Avant toute chose merci de (re)prendre connaissance de la charte et de la respecter.
Pour résumer :
- Avant de poser une question, je cherche si la réponse existe
- Je suis poli, courtois et je respecte tout un chacun sur le forum
- Si un post m'agace : je m'en éloigne plutôt que de répondre d'une façon qui pourrait être mal interprétée


Il n'est jamais du luxe que de rappeler des choses simples :
Courtoisie, amabilité, politesse et bonne humeur sont les maîtres mots pour un forum sympathique, bienveillant et accueillant :)

Le groupe des Helpers est present pour vous aidez, n'hésitez pas à poser des questions ;)

Toute la communauté vous remercie

Plugin OpenZwave

(anciennement dénommé plugin OpenZwave)

Modérateur : nechry

nightfever
Timide
Messages : 143
Inscription : 09 avr. 2015, 13:19
Localisation : Nord

Re: Plugin OpenZwave

Message par nightfever » 16 mai 2015, 21:54

j'ai fais la procédure de loic

j'ai :

Code : Tout sélectionner

16-05-2015 21:44:15 | error | Impossible de lancer le démon openzwave, vérifiez le port
/usr/local/lib/python2.7/dist-packages/python_openzwave_lib-0.2.6-py2.7-linux-armv7l.egg/openzwave/__init__.py:2: UserWarning: Module openzwave was already imported from /usr/local/lib/python2.7/dist-packages/python_openzwave_lib-0.2.6-py2.7-linux-armv7l.egg/openzwave/__init__.pyc, but /usr/local/lib/python2.7/dist-packages/python_openzwave_api-0.2.6-py2.7.egg is being added to sys.path
  __import__('pkg_resources').declare_namespace(__name__)
SQLite version: 3.7.13
Openzwave is installed.
***** Waiting for network to become ready : 
16-05-2015 19:45:07 | info | Openzwave network are started for homeId 0161fd25.
16-05-2015 19:45:07 | info | Controller stateArgument changed to: Normal. Message detail: No command in progress.. controller IsBusy: False
16-05-2015 19:45:07 | info | A new node has been added to OpenZWave list. home_id: [0x0161fd25] id: [1] name: [] model: [].
16-05-2015 19:45:07 | info | A new node has been added to OpenZWave list. home_id: [0x0161fd25] id: [2] name: [] model: [].
16-05-2015 19:45:07 | info | A new node has been added to OpenZWave list. home_id: [0x0161fd25] id: [3] name: [] model: [].
16-05-2015 19:45:13 | debug | The essential queries on a node have been completed. home_id: [0x0161fd25] id: [1] name: [] model: [Z-Stick S2]
16-05-2015 19:45:14 | debug | All the initialisation queries on a node have been completed. home_id: [0x0161fd25] id: [1] name: [] model: [Z-Stick S2]
16-05-2015 19:45:14 | info | write configuration xml file
16-05-2015 19:45:15 | info | write configuration xml file
16-05-2015 19:45:16 | info | Openzwave network is ready with 3 nodes (0 are sleeping). All nodes are queried, the network is fully functionnal.
16-05-2015 19:45:17 | info | write configuration xml file
You killed Openzwave-server!
/usr/local/lib/python2.7/dist-packages/python_openzwave_lib-0.2.6-py2.7-linux-armv7l.egg/openzwave/__init__.py:2: UserWarning: Module openzwave was already imported from /usr/local/lib/python2.7/dist-packages/python_openzwave_lib-0.2.6-py2.7-linux-armv7l.egg/openzwave/__init__.pyc, but /usr/local/lib/python2.7/dist-packages/python_openzwave_api-0.2.6-py2.7.egg is being added to sys.path
  __import__('pkg_resources').declare_namespace(__name__)
SQLite version: 3.7.13
Openzwave is installed.
***** Waiting for network to become ready : 
16-05-2015 19:50:24 | info | Openzwave network are started for homeId 0161fd25.
16-05-2015 19:50:24 | info | Controller stateArgument changed to: Normal. Message detail: No command in progress.. controller IsBusy: False
16-05-2015 19:50:24 | info | A new node has been added to OpenZWave list. home_id: [0x0161fd25] id: [1] name: [] model: [Z-Stick S2].
16-05-2015 19:50:25 | debug | The essential queries on a node have been completed. home_id: [0x0161fd25] id: [1] name: [] model: [Z-Stick S2]
16-05-2015 19:50:25 | info | A new node has been added to OpenZWave list. home_id: [0x0161fd25] id: [2] name: [] model: [].
16-05-2015 19:50:25 | info | A new node has been added to OpenZWave list. home_id: [0x0161fd25] id: [3] name: [] model: [].
16-05-2015 19:50:25 | debug | All the initialisation queries on a node have been completed. home_id: [0x0161fd25] id: [1] name: [] model: [Z-Stick S2]
16-05-2015 19:50:25 | info | write configuration xml file
16-05-2015 19:50:28 | info | write configuration xml file
16-05-2015 19:50:29 | info | Openzwave network is ready with 3 nodes (0 are sleeping). All nodes are queried, the network is fully functionnal.
16-05-2015 19:50:29 | info | write configuration xml file
Edit : @nechry : Tout à l'air d'être actif. il faut que je refasse quand même ta procédure ou pas ?
Rasp PI3+jeedom+RFXcom+ clé 3G huawei E3531
6 x Oregon THGR122NX + 1 capteur DIO + installation knx
NAS DS213 + D-Link DCS4622
RPI 1 & 2 + clé Z-stick S2 (placard pour le moment)
clé 3G X220L (fonctionne pas)

Avatar de l’utilisateur
loic
Administrateur
Messages : 14382
Inscription : 01 févr. 2014, 16:21

Re: Plugin OpenZwave

Message par loic » 16 mai 2015, 22:00

C'est la même chose les 2 procédure
Aide nous à t'aider : mets des logs, détaille ton soucis... Vous n'aurez aucune réponse de ma part si votre demande n'est pas détaillée (log, capture d'écran lisible...) ou si vous ne postez pas dans la bonne section

Avatar de l’utilisateur
nechry
Actif
Messages : 9644
Inscription : 24 juin 2014, 20:07
Localisation : Suisse
Contact :

Re: Plugin OpenZwave

Message par nechry » 16 mai 2015, 22:03

alors tout semble être en ordre maintenant le post de loic a croisé le mien au moment que je rechechais la procédure.
As-tu consulté la documentation avant de poser ta question?
Les demandes de support en MP ne seront pas traité mais j'accepte les dons paypal.me/nechry
Visiter mon blog http://nechry-automation.ch/

nightfever
Timide
Messages : 143
Inscription : 09 avr. 2015, 13:19
Localisation : Nord

Re: Plugin OpenZwave

Message par nightfever » 16 mai 2015, 22:05

quel c*** , pas fait gaf : RM et REMOVE. quel boulet... :?

Bon ok, merci à vous 2, je vais pouvoir chercher un peu comment intégrer un ou 2 modules avant de basculer définitivement (j'ai quand même toute la gestion du chauffage à transférer alors on va y aller molo :mrgreen: )

Et sinon, ca vient d'où le pb ? j'aimerais quand meme comprendre.
En théorie, on installe les 2 plugins et c'est parti, non ?
Y'a quoi qui a buggé dans l'histoire ? une mauvaise manip ? J'ai pourtant suivi le tuto à la lettre...
Rasp PI3+jeedom+RFXcom+ clé 3G huawei E3531
6 x Oregon THGR122NX + 1 capteur DIO + installation knx
NAS DS213 + D-Link DCS4622
RPI 1 & 2 + clé Z-stick S2 (placard pour le moment)
clé 3G X220L (fonctionne pas)

Avatar de l’utilisateur
nechry
Actif
Messages : 9644
Inscription : 24 juin 2014, 20:07
Localisation : Suisse
Contact :

Re: Plugin OpenZwave

Message par nechry » 16 mai 2015, 22:10

@nightfever une des étapes dit installer le plugin zwave sans le serveur zway


Sent from my iPad using Tapatalk
As-tu consulté la documentation avant de poser ta question?
Les demandes de support en MP ne seront pas traité mais j'accepte les dons paypal.me/nechry
Visiter mon blog http://nechry-automation.ch/

nightfever
Timide
Messages : 143
Inscription : 09 avr. 2015, 13:19
Localisation : Nord

Re: Plugin OpenZwave

Message par nightfever » 16 mai 2015, 22:30

ok j'ai pas vu cette phrase sur cette page : http://doc.jeedom.fr/fr_FR/openzwave.html

Mais c'est vrai que le plugin Zwave a été installé avant OpenZwave car je savais que j'allais recevoir la clé.
Bon merci, me reste plus qu'à sauvegarder avant de jouer un peu et découvrir la suite... :mrgreen:

Merci
Rasp PI3+jeedom+RFXcom+ clé 3G huawei E3531
6 x Oregon THGR122NX + 1 capteur DIO + installation knx
NAS DS213 + D-Link DCS4622
RPI 1 & 2 + clé Z-stick S2 (placard pour le moment)
clé 3G X220L (fonctionne pas)

nou
Actif
Messages : 555
Inscription : 17 mai 2015, 00:17

Re: Plugin OpenZwave

Message par nou » 17 mai 2015, 00:23

bonsoir

je rencontre un problème étrange en essayant d'installer le plugin sur raspberry 2 :
à cette commande là (en root) : wget http://127.0.0.1/jeedom/plugins/openzwa ... install.sh -v -O install.sh; ./install.sh
j'obtiens :
bash: ./install.sh: Permission non accordée


une idée ?

totovaauski
Actif
Messages : 1925
Inscription : 05 juil. 2014, 11:21

Re: Plugin OpenZwave

Message par totovaauski » 17 mai 2015, 10:41

Bonjour,
J'aimerai savoir si le "Everspring SP103 " était bien gérer sur OpenZwave et si quelqu'un l'avait fait fonctionner chez lui?
car ca n'a pas l'air de bien marcher sous z-way, alors j'aimerai comparer les confs !
Merci d'avance !
RPI3 + Dongle Aeon
Jeedom sur : Raspberry Pi + Raspberry compute
Mysensors , z-wave, xiaomi ...

https://www.youtube.com/watch?v=-bjbUg9d64g
https://www.youtube.com/watch?v=GPj1ozB ... _b-Toq47NQ

Avatar de l’utilisateur
tmartinez
Modérateur
Messages : 1226
Inscription : 08 juil. 2014, 11:22
Localisation : Limonest

Re: Plugin OpenZwave

Message par tmartinez » 17 mai 2015, 12:52

@nou : lance les commandes :
sudo chmod +x ./install.sh
sudo ./install.sh

@totovaauski : désolé je n'ai pas ce module, je ne peux pas te dire...
Jeedom sous Proxmox
43 Modules Z-Wave / 1x RfxCom / 20 devices connectés
Mon matériel

nou
Actif
Messages : 555
Inscription : 17 mai 2015, 00:17

Re: Plugin OpenZwave

Message par nou » 18 mai 2015, 12:10

merci, top !

shad
Timide
Messages : 42
Inscription : 05 mai 2015, 15:13
Localisation : Paris

Re: Plugin OpenZwave

Message par shad » 18 mai 2015, 21:10

Bonjour,

J'ai voulu mettre a jour openzwave, j'ai re téléchargé via le wget puis chmod le fichier d'install et sudo le .sh.

J'obtiens la log suivante se terminant à la fois par une erreur et par un "Everything is successfully installed!".
Est-ce grave docteur ? :)

Merci par avance!

Copying python_openzwave_api-0.2.6-py2.7.egg to /usr/local/lib/python2.7/dist-packages
python-openzwave-api 0.2.6 is already the active version in easy-install.pth

Installed /usr/local/lib/python2.7/dist-packages/python_openzwave_api-0.2.6-py2.7.egg
Processing dependencies for python-openzwave-api==0.2.6
Traceback (most recent call last):
File "setup-api.py", line 84, in <module>
install_requires=[ dispatch_package ]
File "/usr/lib/python2.7/distutils/core.py", line 151, in setup
dist.run_commands()
File "/usr/lib/python2.7/distutils/dist.py", line 953, in run_commands
self.run_command(cmd)
File "/usr/lib/python2.7/distutils/dist.py", line 972, in run_command
cmd_obj.run()
File "/usr/lib/python2.7/dist-packages/setuptools/command/install.py", line 73, in run
self.do_egg_install()
File "/usr/lib/python2.7/dist-packages/setuptools/command/install.py", line 96, in do_egg_install
cmd.run()
File "/usr/lib/python2.7/dist-packages/setuptools/command/easy_install.py", line 381, in run
self.easy_install(spec, not self.no_deps)
File "/usr/lib/python2.7/dist-packages/setuptools/command/easy_install.py", line 597, in easy_install
return self.install_item(None, spec, tmpdir, deps, True)
File "/usr/lib/python2.7/dist-packages/setuptools/command/easy_install.py", line 648, in install_item
self.process_distribution(spec, dist, deps)
File "/usr/lib/python2.7/dist-packages/setuptools/command/easy_install.py", line 694, in process_distribution
[requirement], self.local_index, self.easy_install
File "/usr/lib/python2.7/dist-packages/pkg_resources.py", line 633, in resolve
requirements.extend(dist.requires(req.extras)[::-1])
File "/usr/lib/python2.7/dist-packages/pkg_resources.py", line 2291, in requires
dm = self._dep_map
File "/usr/lib/python2.7/dist-packages/pkg_resources.py", line 2277, in _dep_map
for extra,reqs in split_sections(self._get_metadata(name)):
File "/usr/lib/python2.7/dist-packages/pkg_resources.py", line 2715, in split_sections
for line in yield_lines(s):
File "/usr/lib/python2.7/dist-packages/pkg_resources.py", line 1989, in yield_lines
for ss in strs:
File "/usr/lib/python2.7/dist-packages/pkg_resources.py", line 2305, in _get_metadata
for line in self.get_metadata_lines(name):
File "/usr/lib/python2.7/dist-packages/pkg_resources.py", line 1369, in get_metadata_lines
return yield_lines(self.get_metadata(name))
File "/usr/lib/python2.7/dist-packages/pkg_resources.py", line 1361, in get_metadata
return self._get(self._fn(self.egg_info,name))
File "/usr/lib/python2.7/dist-packages/pkg_resources.py", line 1425, in _get
return self.loader.get_data(path)
zipimport.ZipImportError: bad local file header in /usr/local/lib/python2.7/dist-packages/python_openzwave_api-0.2.6-py2.7.egg
make: *** [install] Error 1
mkdir: cannot create directory ‘/opt/python-openzwave/python-eggs’: File exists
Everything is successfully installed!

Avatar de l’utilisateur
tmartinez
Modérateur
Messages : 1226
Inscription : 08 juil. 2014, 11:22
Localisation : Limonest

Re: Plugin OpenZwave

Message par tmartinez » 18 mai 2015, 21:14

salut @shad,
Tu passes d'une ancienne version d'OpenZwave à une des nouvelles.
Le plus simple est de supprimer le répertoire /opt/python-openzwave (sudo rm -Rf /opt/python-openzwave) et de relancer le script d'install.
Les associations ne seront pas perdues.
A++
Jeedom sous Proxmox
43 Modules Z-Wave / 1x RfxCom / 20 devices connectés
Mon matériel

shad
Timide
Messages : 42
Inscription : 05 mai 2015, 15:13
Localisation : Paris

Re: Plugin OpenZwave

Message par shad » 18 mai 2015, 22:47

Merci mais le problème persiste même avec "sudo rm -Rf /opt/python-openzwave"

zipimport.ZipImportError: bad local file header in /usr/local/lib/python2.7/dist-packages/python_openzwave_api-0.2.6-py2.7.egg
make: *** [install] Error 1

Le serveur openzwave démarre bien sous jeedom, mais je ne sais pas s'il a été mis à jour.
Ci dessous la log :

Code : Tout sélectionner

 
odroid@odroid:~$ sudo rm -Rf /opt/python-openzwave
odroid@odroid:~$ wget http://127.0.0.1/jeedom/plugins/openzwave/ressources/install.sh -v -O install.sh;
--2015-05-18 22:29:31--  http://127.0.0.1/jeedom/plugins/openzwave/ressources/install.sh
Connecting to 127.0.0.1:80... connected.
HTTP request sent, awaiting response... 200 OK
Length: 2568 (2.5K) [application/octet-stream]
Saving to: ‘install.sh’

100%[======================================>] 2,568       --.-K/s   in 0s

2015-05-18 22:29:31 (84.4 MB/s) - ‘install.sh’ saved [2568/2568]

odroid@odroid:~$ chmod 777 install.sh
odroid@odroid:~$ sudo ./install.sh
Ign http://ports.ubuntu.com trusty InRelease
Ign http://ports.ubuntu.com trusty-updates InRelease
Ign http://ppa.launchpad.net trusty InRelease
Ign http://ports.ubuntu.com trusty-backports InRelease
Ign http://ppa.launchpad.net trusty InRelease
Ign http://ports.ubuntu.com trusty-security InRelease
Hit http://ports.ubuntu.com trusty Release.gpg
Ign http://ppa.launchpad.net trusty InRelease
Hit http://ports.ubuntu.com trusty-updates Release.gpg
Ign http://ppa.launchpad.net trusty InRelease
Hit http://ports.ubuntu.com trusty-backports Release.gpg
Hit http://ports.ubuntu.com trusty-security Release.gpg
Ign http://ppa.launchpad.net trusty InRelease
Hit http://ports.ubuntu.com trusty Release
Hit http://ports.ubuntu.com trusty-updates Release
Hit http://ppa.launchpad.net trusty Release.gpg
Hit http://ppa.launchpad.net trusty Release.gpg
Hit http://ports.ubuntu.com trusty-backports Release
Hit http://ports.ubuntu.com trusty-security Release
Hit http://ppa.launchpad.net trusty Release.gpg
Hit http://ppa.launchpad.net trusty Release.gpg
Hit http://deb.odroid.in trusty InRelease
Hit http://ports.ubuntu.com trusty/main Sources
Hit http://ppa.launchpad.net trusty Release.gpg
Hit http://ppa.launchpad.net trusty Release
Hit http://ports.ubuntu.com trusty/restricted Sources
Hit http://ppa.launchpad.net trusty Release
Hit http://ports.ubuntu.com trusty/universe Sources
Hit http://ppa.launchpad.net trusty Release
Hit http://ports.ubuntu.com trusty/main armhf Packages
Hit http://ports.ubuntu.com trusty/restricted armhf Packages
Hit http://ppa.launchpad.net trusty Release
Hit http://deb.odroid.in trusty InRelease
Hit http://ports.ubuntu.com trusty/universe armhf Packages
Hit http://ppa.launchpad.net trusty Release
Hit http://ports.ubuntu.com trusty/main Translation-en
Hit http://ppa.launchpad.net trusty/main Sources
Hit http://ports.ubuntu.com trusty/restricted Translation-en
Hit http://ppa.launchpad.net trusty/main armhf Packages
Hit http://ppa.launchpad.net trusty/main Translation-en
Hit http://ports.ubuntu.com trusty/universe Translation-en
Hit http://ports.ubuntu.com trusty-updates/main Sources
Hit http://deb.odroid.in trusty/main armhf Packages
Hit http://ports.ubuntu.com trusty-updates/restricted Sources
Hit http://ports.ubuntu.com trusty-updates/universe Sources
Hit http://ports.ubuntu.com trusty-updates/main armhf Packages
Hit http://ppa.launchpad.net trusty/main Sources
Hit http://ports.ubuntu.com trusty-updates/restricted armhf Packages
Hit http://ppa.launchpad.net trusty/main armhf Packages
Hit http://ports.ubuntu.com trusty-updates/universe armhf Packages
Hit http://ports.ubuntu.com trusty-updates/main Translation-en
Hit http://ppa.launchpad.net trusty/main Translation-en
Hit http://ports.ubuntu.com trusty-updates/restricted Translation-en
Hit http://ppa.launchpad.net trusty/main Sources
Hit http://ports.ubuntu.com trusty-updates/universe Translation-en
Hit http://ppa.launchpad.net trusty/main armhf Packages
Hit http://ports.ubuntu.com trusty-backports/main Sources
Hit http://ports.ubuntu.com trusty-backports/restricted Sources
Hit http://ppa.launchpad.net trusty/main Translation-en
Hit http://ports.ubuntu.com trusty-backports/main armhf Packages
Hit http://ppa.launchpad.net trusty/main armhf Packages
Hit http://ports.ubuntu.com trusty-backports/restricted armhf Packages
Hit http://ports.ubuntu.com trusty-backports/main Translation-en
Hit http://ppa.launchpad.net trusty/main Translation-en
Hit http://ppa.launchpad.net trusty/main armhf Packages
Hit http://ppa.launchpad.net trusty/main Translation-en
Hit http://ports.ubuntu.com trusty-backports/restricted Translation-en
Hit http://ports.ubuntu.com trusty-security/main Sources
Hit http://ports.ubuntu.com trusty-security/restricted Sources
Hit http://ports.ubuntu.com trusty-security/universe Sources
Hit http://ports.ubuntu.com trusty-security/multiverse Sources
Hit http://ports.ubuntu.com trusty-security/main armhf Packages
Hit http://deb.odroid.in trusty/main armhf Packages
Hit http://ports.ubuntu.com trusty-security/restricted armhf Packages
Hit http://ports.ubuntu.com trusty-security/universe armhf Packages
Hit http://ports.ubuntu.com trusty-security/multiverse armhf Packages
Hit http://ports.ubuntu.com trusty-security/main Translation-en
Hit http://ports.ubuntu.com trusty-security/multiverse Translation-en
Hit http://ports.ubuntu.com trusty-security/restricted Translation-en
Hit http://ports.ubuntu.com trusty-security/universe Translation-en
Ign http://ports.ubuntu.com trusty/main Translation-en_US
Ign http://ports.ubuntu.com trusty/restricted Translation-en_US
Ign http://ports.ubuntu.com trusty/universe Translation-en_US
Ign http://deb.odroid.in trusty/main Translation-en_US
Ign http://deb.odroid.in trusty/main Translation-en
Ign http://deb.odroid.in trusty/main Translation-en_US
Ign http://deb.odroid.in trusty/main Translation-en
Reading package lists... Done
Installation des dependances
Reading package lists... Done
Building dependency tree
Reading state information... Done
mercurial is already the newest version.
0 upgraded, 0 newly installed, 0 to remove and 5 not upgraded.
Reading package lists... Done
Building dependency tree
Reading state information... Done
git is already the newest version.
0 upgraded, 0 newly installed, 0 to remove and 5 not upgraded.
Reading package lists... Done
Building dependency tree
Reading state information... Done
python-pip is already the newest version.
0 upgraded, 0 newly installed, 0 to remove and 5 not upgraded.
Reading package lists... Done
Building dependency tree
Reading state information... Done
python-dev is already the newest version.
0 upgraded, 0 newly installed, 0 to remove and 5 not upgraded.
Reading package lists... Done
Building dependency tree
Reading state information... Done
python-setuptools is already the newest version.
0 upgraded, 0 newly installed, 0 to remove and 5 not upgraded.
Reading package lists... Done
Building dependency tree
Reading state information... Done
python-louie is already the newest version.
0 upgraded, 0 newly installed, 0 to remove and 5 not upgraded.
Reading package lists... Done
Building dependency tree
Reading state information... Done
python-sphinx is already the newest version.
0 upgraded, 0 newly installed, 0 to remove and 5 not upgraded.
Reading package lists... Done
Building dependency tree
Reading state information... Done
make is already the newest version.
0 upgraded, 0 newly installed, 0 to remove and 5 not upgraded.
Reading package lists... Done
Building dependency tree
Reading state information... Done
build-essential is already the newest version.
0 upgraded, 0 newly installed, 0 to remove and 5 not upgraded.
Reading package lists... Done
Building dependency tree
Reading state information... Done
libudev-dev is already the newest version.
0 upgraded, 0 newly installed, 0 to remove and 5 not upgraded.
Reading package lists... Done
Building dependency tree
Reading state information... Done
g++ is already the newest version.
0 upgraded, 0 newly installed, 0 to remove and 5 not upgraded.
Reading package lists... Done
Building dependency tree
Reading state information... Done
gcc is already the newest version.
0 upgraded, 0 newly installed, 0 to remove and 5 not upgraded.
Installation des dependances Python
Requirement already satisfied (use --upgrade to upgrade): cython==0.14 in /usr/local/lib/python2.7/dist-packages
Cleaning up...
Requirement already satisfied (use --upgrade to upgrade): sphinxcontrib-blockdiag in /usr/local/lib/python2.7/dist-packages
Cleaning up...
Requirement already satisfied (use --upgrade to upgrade): sphinxcontrib-actdiag in /usr/local/lib/python2.7/dist-packages
Cleaning up...
Requirement already satisfied (use --upgrade to upgrade): sphinxcontrib-nwdiag in /usr/local/lib/python2.7/dist-packages
Cleaning up...
Requirement already satisfied (use --upgrade to upgrade): sphinxcontrib-seqdiag in /usr/local/lib/python2.7/dist-packages
Cleaning up...
Requirement already satisfied (use --upgrade to upgrade): urwid in /usr/local/lib/python2.7/dist-packages
Cleaning up...
Requirement already satisfied (use --upgrade to upgrade): louie in /usr/lib/python2.7/dist-packages
Requirement already satisfied (use --upgrade to upgrade): nose>=0.8.3 in /usr/lib/python2.7/dist-packages (from louie)
Cleaning up...
Requirement already satisfied (use --upgrade to upgrade): flask in /usr/local/lib/python2.7/dist-packages
Requirement already satisfied (use --upgrade to upgrade): Werkzeug>=0.7 in /usr/local/lib/python2.7/dist-packages (from flask)
Requirement already satisfied (use --upgrade to upgrade): Jinja2>=2.4 in /usr/lib/python2.7/dist-packages (from flask)
Requirement already satisfied (use --upgrade to upgrade): itsdangerous>=0.21 in /usr/local/lib/python2.7/dist-packages (from flask)
Requirement already satisfied (use --upgrade to upgrade): markupsafe in /usr/lib/python2.7/dist-packages (from Jinja2>=2.4->flask)
Cleaning up...
Requirement already satisfied (use --upgrade to upgrade): flask-restful in /usr/local/lib/python2.7/dist-packages
Cleaning up...
Installation de Python-OpenZwave
mkdir: cannot create directory ‘/opt’: File exists
Download sources of Python-Openzwave
Cloning into '/opt/python-openzwave'...
remote: Counting objects: 3464, done.
remote: Total 3464 (delta 0), reused 0 (delta 0), pack-reused 3464
Receiving objects: 100% (3464/3464), 8.10 MiB | 829.00 KiB/s, done.
Resolving deltas: 100% (2479/2479), done.
Checking connectivity... done.
Download sources of Openzwave
Cloning into 'openzwave'...
remote: Counting objects: 12490, done.
remote: Compressing objects: 100% (50/50), done.
remote: Total 12490 (delta 23), reused 0 (delta 0), pack-reused 12439
Receiving objects: 100% (12490/12490), 98.95 MiB | 2.32 MiB/s, done.
Resolving deltas: 100% (9556/9556), done.
Checking connectivity... done.
Sources updated
rm -rf _build
find . -name *.pyc -delete
cd openzwave && make clean
make[1]: Entering directory `/opt/python-openzwave/openzwave'
make -C /opt/python-openzwave/openzwave/cpp/build/ -w clean
make[2]: Entering directory `/opt/python-openzwave/openzwave/cpp/build'
make[2]: Leaving directory `/opt/python-openzwave/openzwave/cpp/build'
make[2]: Entering directory `/opt/python-openzwave/openzwave/cpp/build'
make[2]: Leaving directory `/opt/python-openzwave/openzwave/cpp/build'
make -C /opt/python-openzwave/openzwave/cpp/examples/MinOZW/ -w clean
make[2]: Entering directory `/opt/python-openzwave/openzwave/cpp/examples/MinOZW'
make[2]: Leaving directory `/opt/python-openzwave/openzwave/cpp/examples/MinOZW'
make[2]: Entering directory `/opt/python-openzwave/openzwave/cpp/examples/MinOZW'
make[2]: Leaving directory `/opt/python-openzwave/openzwave/cpp/examples/MinOZW'
make[1]: Leaving directory `/opt/python-openzwave/openzwave'
python setup-lib.py clean
running clean
python setup-api.py clean
running clean
rm -Rf build/
rm lib/libopenzwave.cpp
rm: cannot remove ‘lib/libopenzwave.cpp’: No such file or directory
make: [clean] Error 1 (ignored)
sed -i '253s/.*//' openzwave/cpp/src/value_classes/ValueID.h
cd openzwave && VERSION_REV=0 make
make[1]: Entering directory `/opt/python-openzwave/openzwave'
make -C /opt/python-openzwave/openzwave/cpp/build/ -w
make[2]: Entering directory `/opt/python-openzwave/openzwave/cpp/build'
make[2]: Leaving directory `/opt/python-openzwave/openzwave/cpp/build'
make[2]: Entering directory `/opt/python-openzwave/openzwave/cpp/build'
Building OpenZWave Version 1.3-189-gedf8d2a-dirty
Building tinystr.o
Building tinyxml.o
Building tinyxmlerror.o
Building tinyxmlparser.o
Building hid.o
Building aescrypt.o
Building aeskey.o
Building aes_modes.o
Building aestab.o
Building Alarm.o
Building ApplicationStatus.o
Building AssociationCommandConfiguration.o
Building Association.o
Building Basic.o
Building BasicWindowCovering.o
Building Battery.o
Building CentralScene.o
Building ClimateControlSchedule.o
Building Clock.o
Building CommandClass.o
Building CommandClasses.o
Building Configuration.o
Building ControllerReplication.o
Building CRC16Encap.o
Building DoorLock.o
Building DoorLockLogging.o
Building EnergyProduction.o
Building Hail.o
Building Indicator.o
Building Language.o
Building Lock.o
Building ManufacturerSpecific.o
Building Meter.o
Building MeterPulse.o
Building MultiCmd.o
Building MultiInstanceAssociation.o
Building MultiInstance.o
Building NodeNaming.o
Building NoOperation.o
Building Powerlevel.o
Building Proprietary.o
Building Protection.o
Building SceneActivation.o
Building Security.o
Building SensorAlarm.o
Building SensorBinary.o
Building SensorMultilevel.o
Building SwitchAll.o
Building SwitchBinary.o
Building SwitchMultilevel.o
Building SwitchToggleBinary.o
Building SwitchToggleMultilevel.o
Building ThermostatFanMode.o
Building ThermostatFanState.o
Building ThermostatMode.o
Building ThermostatOperatingState.o
Building ThermostatSetpoint.o
Building TimeParameters.o
Building UserCode.o
Building Version.o
Building WakeUp.o
Building ValueBool.o
Building ValueButton.o
Building ValueByte.o
Building Value.o
Building ValueDecimal.o
Building ValueInt.o
Building ValueList.o
Building ValueRaw.o
Building ValueSchedule.o
Building ValueShort.o
Building ValueStore.o
Building ValueString.o
Building Controller.o
Building Event.o
Building FileOps.o
Building HidController.o
Building Log.o
Building Mutex.o
Building SerialController.o
Building Stream.o
Building Thread.o
Building TimeStamp.o
Building Wait.o
Building EventImpl.o
Building FileOpsImpl.o
Building LogImpl.o
Building MutexImpl.o
Building SerialControllerImpl.o
Building ThreadImpl.o
Building TimeStampImpl.o
Building WaitImpl.o
Building Driver.o
Building Group.o
Building Manager.o
Building Msg.o
Building Node.o
Building Options.o
Building Scene.o
Building Utils.o
Creating vers.cpp
Building vers.o
Linking Static Library
Linking Shared Library
make[2]: Leaving directory `/opt/python-openzwave/openzwave/cpp/build'
make -C /opt/python-openzwave/openzwave/cpp/examples/MinOZW/ -w
make[2]: Entering directory `/opt/python-openzwave/openzwave/cpp/examples/MinOZW'
make[2]: Leaving directory `/opt/python-openzwave/openzwave/cpp/examples/MinOZW'
make[2]: Entering directory `/opt/python-openzwave/openzwave/cpp/examples/MinOZW'
Building Main.o
Linking /opt/python-openzwave/openzwave/.lib/MinOZW
g++  -o /opt/python-openzwave/openzwave/.lib/MinOZW /opt/python-openzwave/openzwave/.lib/Main.o /opt/python-openzwave/openzwave/libopenzwave.so -pthread
Creating Temporary Shell Launch Script
make[2]: Leaving directory `/opt/python-openzwave/openzwave/cpp/examples/MinOZW'
make[1]: Leaving directory `/opt/python-openzwave/openzwave'
python setup-api.py build
running build
running build_py
creating build
creating build/lib.linux-armv7l-2.7
creating build/lib.linux-armv7l-2.7/openzwave
copying api/object.py -> build/lib.linux-armv7l-2.7/openzwave
copying api/group.py -> build/lib.linux-armv7l-2.7/openzwave
copying api/scene.py -> build/lib.linux-armv7l-2.7/openzwave
copying api/option.py -> build/lib.linux-armv7l-2.7/openzwave
copying api/controller.py -> build/lib.linux-armv7l-2.7/openzwave
copying api/value.py -> build/lib.linux-armv7l-2.7/openzwave
copying api/__init__.py -> build/lib.linux-armv7l-2.7/openzwave
copying api/network.py -> build/lib.linux-armv7l-2.7/openzwave
copying api/command.py -> build/lib.linux-armv7l-2.7/openzwave
copying api/node.py -> build/lib.linux-armv7l-2.7/openzwave
creating build/lib.linux-armv7l-2.7/pyozwman
copying manager/ozwsh_widgets.py -> build/lib.linux-armv7l-2.7/pyozwman
copying manager/__init__.py -> build/lib.linux-armv7l-2.7/pyozwman
copying manager/ozwsh.py -> build/lib.linux-armv7l-2.7/pyozwman
python setup-lib.py build
running build
running build_py
package init file 'lib/__init__.py' not found (or not a regular file)
running build_ext
cythoning lib/libopenzwave.pyx to lib/libopenzwave.cpp
building 'libopenzwave' extension
creating build/temp.linux-armv7l-2.7
creating build/temp.linux-armv7l-2.7/lib
arm-linux-gnueabihf-gcc -pthread -fno-strict-aliasing -DNDEBUG -g -fwrapv -O2 -Wall -Wstrict-prototypes -fPIC -Iopenzwave/cpp/src -Iopenzwave/cpp/src/value_classes -Iopenzwave/cpp/src/platform -Iopenzwave/cpp/build/linux -I/usr/include/python2.7 -c lib/libopenzwave.cpp -o build/temp.linux-armv7l-2.7/lib/libopenzwave.o
cc1plus: warning: command line option ‘-Wstrict-prototypes’ is valid for C/ObjC but not for C++
c++ -pthread -shared -Wl,-O1 -Wl,-Bsymbolic-functions -Wl,-Bsymbolic-functions -Wl,-z,relro -fno-strict-aliasing -DNDEBUG -g -fwrapv -O2 -Wall -Wstrict-prototypes -D_FORTIFY_SOURCE=2 -g -fstack-protector --param=ssp-buffer-size=4 -Wformat -Werror=format-security build/temp.linux-armv7l-2.7/lib/libopenzwave.o openzwave/libopenzwave.a -ludev -lstdc++ -o build/lib.linux-armv7l-2.7/libopenzwave.so
sed -i '253s/.*//' openzwave/cpp/src/value_classes/ValueID.h
cd openzwave && VERSION_REV=0 make
make[1]: Entering directory `/opt/python-openzwave/openzwave'
make -C /opt/python-openzwave/openzwave/cpp/build/ -w
make[2]: Entering directory `/opt/python-openzwave/openzwave/cpp/build'
make[2]: Leaving directory `/opt/python-openzwave/openzwave/cpp/build'
make[2]: Entering directory `/opt/python-openzwave/openzwave/cpp/build'
Building OpenZWave Version 1.3-189-gedf8d2a-dirty
make[2]: Leaving directory `/opt/python-openzwave/openzwave/cpp/build'
make -C /opt/python-openzwave/openzwave/cpp/examples/MinOZW/ -w
make[2]: Entering directory `/opt/python-openzwave/openzwave/cpp/examples/MinOZW'
make[2]: Leaving directory `/opt/python-openzwave/openzwave/cpp/examples/MinOZW'
make[2]: Entering directory `/opt/python-openzwave/openzwave/cpp/examples/MinOZW'
make[2]: Nothing to be done for `default'.
make[2]: Leaving directory `/opt/python-openzwave/openzwave/cpp/examples/MinOZW'
make[1]: Leaving directory `/opt/python-openzwave/openzwave'
python setup-api.py build
running build
running build_py
python setup-lib.py build
running build
running build_py
package init file 'lib/__init__.py' not found (or not a regular file)
running build_ext
skipping 'lib/libopenzwave.cpp' Cython extension (up-to-date)
sudo python setup-lib.py install
running install
running bdist_egg
running egg_info
creating python_openzwave_lib.egg-info
writing python_openzwave_lib.egg-info/PKG-INFO
writing top-level names to python_openzwave_lib.egg-info/top_level.txt
writing dependency_links to python_openzwave_lib.egg-info/dependency_links.txt
writing manifest file 'python_openzwave_lib.egg-info/SOURCES.txt'
package init file 'lib/__init__.py' not found (or not a regular file)
reading manifest file 'python_openzwave_lib.egg-info/SOURCES.txt'
writing manifest file 'python_openzwave_lib.egg-info/SOURCES.txt'
installing library code to build/bdist.linux-armv7l/egg
running install_lib
running build_py
running build_ext
skipping 'lib/libopenzwave.cpp' Cython extension (up-to-date)
creating build/bdist.linux-armv7l
creating build/bdist.linux-armv7l/egg
creating build/bdist.linux-armv7l/egg/pyozwman
copying build/lib.linux-armv7l-2.7/pyozwman/ozwsh_widgets.py -> build/bdist.linux-armv7l/egg/pyozwman
copying build/lib.linux-armv7l-2.7/pyozwman/__init__.py -> build/bdist.linux-armv7l/egg/pyozwman
copying build/lib.linux-armv7l-2.7/pyozwman/ozwsh.py -> build/bdist.linux-armv7l/egg/pyozwman
copying build/lib.linux-armv7l-2.7/libopenzwave.so -> build/bdist.linux-armv7l/egg
creating build/bdist.linux-armv7l/egg/openzwave
copying build/lib.linux-armv7l-2.7/openzwave/object.py -> build/bdist.linux-armv7l/egg/openzwave
copying build/lib.linux-armv7l-2.7/openzwave/group.py -> build/bdist.linux-armv7l/egg/openzwave
copying build/lib.linux-armv7l-2.7/openzwave/scene.py -> build/bdist.linux-armv7l/egg/openzwave
copying build/lib.linux-armv7l-2.7/openzwave/option.py -> build/bdist.linux-armv7l/egg/openzwave
copying build/lib.linux-armv7l-2.7/openzwave/controller.py -> build/bdist.linux-armv7l/egg/openzwave
copying build/lib.linux-armv7l-2.7/openzwave/value.py -> build/bdist.linux-armv7l/egg/openzwave
copying build/lib.linux-armv7l-2.7/openzwave/__init__.py -> build/bdist.linux-armv7l/egg/openzwave
copying build/lib.linux-armv7l-2.7/openzwave/network.py -> build/bdist.linux-armv7l/egg/openzwave
copying build/lib.linux-armv7l-2.7/openzwave/command.py -> build/bdist.linux-armv7l/egg/openzwave
copying build/lib.linux-armv7l-2.7/openzwave/node.py -> build/bdist.linux-armv7l/egg/openzwave
byte-compiling build/bdist.linux-armv7l/egg/pyozwman/ozwsh_widgets.py to ozwsh_widgets.pyc
byte-compiling build/bdist.linux-armv7l/egg/pyozwman/__init__.py to __init__.pyc
byte-compiling build/bdist.linux-armv7l/egg/pyozwman/ozwsh.py to ozwsh.pyc
byte-compiling build/bdist.linux-armv7l/egg/openzwave/object.py to object.pyc
byte-compiling build/bdist.linux-armv7l/egg/openzwave/group.py to group.pyc
byte-compiling build/bdist.linux-armv7l/egg/openzwave/scene.py to scene.pyc
byte-compiling build/bdist.linux-armv7l/egg/openzwave/option.py to option.pyc
byte-compiling build/bdist.linux-armv7l/egg/openzwave/controller.py to controller.pyc
byte-compiling build/bdist.linux-armv7l/egg/openzwave/value.py to value.pyc
byte-compiling build/bdist.linux-armv7l/egg/openzwave/__init__.py to __init__.pyc
byte-compiling build/bdist.linux-armv7l/egg/openzwave/network.py to network.pyc
byte-compiling build/bdist.linux-armv7l/egg/openzwave/command.py to command.pyc
byte-compiling build/bdist.linux-armv7l/egg/openzwave/node.py to node.pyc
creating stub loader for libopenzwave.so
byte-compiling build/bdist.linux-armv7l/egg/libopenzwave.py to libopenzwave.pyc
installing package data to build/bdist.linux-armv7l/egg
running install_data
creating build/bdist.linux-armv7l/egg/share
creating build/bdist.linux-armv7l/egg/share/python-openzwave
creating build/bdist.linux-armv7l/egg/share/python-openzwave/config
copying openzwave/config/device_classes.xml -> build/bdist.linux-armv7l/egg/share/python-openzwave/config
copying openzwave/config/options.xml -> build/bdist.linux-armv7l/egg/share/python-openzwave/config
copying openzwave/config/manufacturer_specific.xml -> build/bdist.linux-armv7l/egg/share/python-openzwave/config
creating build/bdist.linux-armv7l/egg/share/python-openzwave/config/swiid
copying openzwave/config/swiid/swiidinter.xml -> build/bdist.linux-armv7l/egg/share/python-openzwave/config/swiid
creating build/bdist.linux-armv7l/egg/share/python-openzwave/config/2gig
copying openzwave/config/2gig/ct101.xml -> build/bdist.linux-armv7l/egg/share/python-openzwave/config/2gig
copying openzwave/config/2gig/ct100.xml -> build/bdist.linux-armv7l/egg/share/python-openzwave/config/2gig
copying openzwave/config/2gig/ct30.xml -> build/bdist.linux-armv7l/egg/share/python-openzwave/config/2gig
creating build/bdist.linux-armv7l/egg/share/python-openzwave/config/wenzhou
copying openzwave/config/wenzhou/tz65d.xml -> build/bdist.linux-armv7l/egg/share/python-openzwave/config/wenzhou
copying openzwave/config/wenzhou/tz66d.xml -> build/bdist.linux-armv7l/egg/share/python-openzwave/config/wenzhou
copying openzwave/config/wenzhou/tsp01.xml -> build/bdist.linux-armv7l/egg/share/python-openzwave/config/wenzhou
copying openzwave/config/wenzhou/tz67.xml -> build/bdist.linux-armv7l/egg/share/python-openzwave/config/wenzhou
copying openzwave/config/wenzhou/sm103.xml -> build/bdist.linux-armv7l/egg/share/python-openzwave/config/wenzhou
copying openzwave/config/wenzhou/tz88.xml -> build/bdist.linux-armv7l/egg/share/python-openzwave/config/wenzhou
creating build/bdist.linux-armv7l/egg/share/python-openzwave/config/intermatic
copying openzwave/config/intermatic/ca8900.xml -> build/bdist.linux-armv7l/egg/share/python-openzwave/config/intermatic
creating build/bdist.linux-armv7l/egg/share/python-openzwave/config/trane
copying openzwave/config/trane/TZEMT400AB32MAA.xml -> build/bdist.linux-armv7l/egg/share/python-openzwave/config/trane
copying openzwave/config/trane/TZEMT400BB32MAA.xml -> build/bdist.linux-armv7l/egg/share/python-openzwave/config/trane
creating build/bdist.linux-armv7l/egg/share/python-openzwave/config/BeNext
copying openzwave/config/BeNext/DoorSensor.xml -> build/bdist.linux-armv7l/egg/share/python-openzwave/config/BeNext
copying openzwave/config/BeNext/SceneController.xml -> build/bdist.linux-armv7l/egg/share/python-openzwave/config/BeNext
copying openzwave/config/BeNext/1poleswitch.xml -> build/bdist.linux-armv7l/egg/share/python-openzwave/config/BeNext
copying openzwave/config/BeNext/2poleswitch.xml -> build/bdist.linux-armv7l/egg/share/python-openzwave/config/BeNext
copying openzwave/config/BeNext/EnergySwitch.xml -> build/bdist.linux-armv7l/egg/share/python-openzwave/config/BeNext
copying openzwave/config/BeNext/Molite.xml -> build/bdist.linux-armv7l/egg/share/python-openzwave/config/BeNext
copying openzwave/config/BeNext/BuiltinDimmer.xml -> build/bdist.linux-armv7l/egg/share/python-openzwave/config/BeNext
copying openzwave/config/BeNext/PluginDimmer.xml -> build/bdist.linux-armv7l/egg/share/python-openzwave/config/BeNext
copying openzwave/config/BeNext/AlarmSound.xml -> build/bdist.linux-armv7l/egg/share/python-openzwave/config/BeNext
copying openzwave/config/BeNext/TagReader.xml -> build/bdist.linux-armv7l/egg/share/python-openzwave/config/BeNext
creating build/bdist.linux-armv7l/egg/share/python-openzwave/config/frostdale
copying openzwave/config/frostdale/fdn2nxx.xml -> build/bdist.linux-armv7l/egg/share/python-openzwave/config/frostdale
creating build/bdist.linux-armv7l/egg/share/python-openzwave/config/duwi
copying openzwave/config/duwi/ZWESJ300.xml -> build/bdist.linux-armv7l/egg/share/python-openzwave/config/duwi
copying openzwave/config/duwi/ZWES1000.xml -> build/bdist.linux-armv7l/egg/share/python-openzwave/config/duwi
creating build/bdist.linux-armv7l/egg/share/python-openzwave/config/evolve
copying openzwave/config/evolve/lsm-15.xml -> build/bdist.linux-armv7l/egg/share/python-openzwave/config/evolve
copying openzwave/config/evolve/lrm-as.xml -> build/bdist.linux-armv7l/egg/share/python-openzwave/config/evolve
copying openzwave/config/evolve/ltm-5.xml -> build/bdist.linux-armv7l/egg/share/python-openzwave/config/evolve
creating build/bdist.linux-armv7l/egg/share/python-openzwave/config/vitrum
copying openzwave/config/vitrum/vitrumBS.xml -> build/bdist.linux-armv7l/egg/share/python-openzwave/config/vitrum
creating build/bdist.linux-armv7l/egg/share/python-openzwave/config/fibaro
copying openzwave/config/fibaro/fgms.xml -> build/bdist.linux-armv7l/egg/share/python-openzwave/config/fibaro
copying openzwave/config/fibaro/fgk001.xml -> build/bdist.linux-armv7l/egg/share/python-openzwave/config/fibaro
copying openzwave/config/fibaro/fgrgbwm441.xml -> build/bdist.linux-armv7l/egg/share/python-openzwave/config/fibaro
copying openzwave/config/fibaro/fgsd002.xml -> build/bdist.linux-armv7l/egg/share/python-openzwave/config/fibaro
copying openzwave/config/fibaro/fgr221.xml -> build/bdist.linux-armv7l/egg/share/python-openzwave/config/fibaro
copying openzwave/config/fibaro/fgwpe.xml -> build/bdist.linux-armv7l/egg/share/python-openzwave/config/fibaro
copying openzwave/config/fibaro/fgs221.xml -> build/bdist.linux-armv7l/egg/share/python-openzwave/config/fibaro
copying openzwave/config/fibaro/fgs211.xml -> build/bdist.linux-armv7l/egg/share/python-openzwave/config/fibaro
copying openzwave/config/fibaro/fgfs101.xml -> build/bdist.linux-armv7l/egg/share/python-openzwave/config/fibaro
copying openzwave/config/fibaro/fgrm222.xml -> build/bdist.linux-armv7l/egg/share/python-openzwave/config/fibaro
copying openzwave/config/fibaro/fgss101.xml -> build/bdist.linux-armv7l/egg/share/python-openzwave/config/fibaro
copying openzwave/config/fibaro/fgd211.xml -> build/bdist.linux-armv7l/egg/share/python-openzwave/config/fibaro
copying openzwave/config/fibaro/fgbs001.xml -> build/bdist.linux-armv7l/egg/share/python-openzwave/config/fibaro
creating build/bdist.linux-armv7l/egg/share/python-openzwave/config/schlagelink
copying openzwave/config/schlagelink/minikeypad.xml -> build/bdist.linux-armv7l/egg/share/python-openzwave/config/schlagelink
copying openzwave/config/schlagelink/itemp.xml -> build/bdist.linux-armv7l/egg/share/python-openzwave/config/schlagelink
creating build/bdist.linux-armv7l/egg/share/python-openzwave/config/honeywell
copying openzwave/config/honeywell/th8320zw1000.xml -> build/bdist.linux-armv7l/egg/share/python-openzwave/config/honeywell
creating build/bdist.linux-armv7l/egg/share/python-openzwave/config/philio
copying openzwave/config/philio/psm02.xml -> build/bdist.linux-armv7l/egg/share/python-openzwave/config/philio
copying openzwave/config/philio/pst02-1c.xml -> build/bdist.linux-armv7l/egg/share/python-openzwave/config/philio
copying openzwave/config/philio/pst02.xml -> build/bdist.linux-armv7l/egg/share/python-openzwave/config/philio
copying openzwave/config/philio/pst02-b.xml -> build/bdist.linux-armv7l/egg/share/python-openzwave/config/philio
copying openzwave/config/philio/pan04.xml -> build/bdist.linux-armv7l/egg/share/python-openzwave/config/philio
creating build/bdist.linux-armv7l/egg/share/python-openzwave/config/popp
copying openzwave/config/popp/123658.xml -> build/bdist.linux-armv7l/egg/share/python-openzwave/config/popp
copying openzwave/config/popp/123580.xml -> build/bdist.linux-armv7l/egg/share/python-openzwave/config/popp
copying openzwave/config/popp/123601.xml -> build/bdist.linux-armv7l/egg/share/python-openzwave/config/popp
creating build/bdist.linux-armv7l/egg/share/python-openzwave/config/dragontech
copying openzwave/config/dragontech/wd-100.xml -> build/bdist.linux-armv7l/egg/share/python-openzwave/config/dragontech
creating build/bdist.linux-armv7l/egg/share/python-openzwave/config/leviton
copying openzwave/config/leviton/vri10.xml -> build/bdist.linux-armv7l/egg/share/python-openzwave/config/leviton
copying openzwave/config/leviton/rzi10.xml -> build/bdist.linux-armv7l/egg/share/python-openzwave/config/leviton
copying openzwave/config/leviton/vrcpg.xml -> build/bdist.linux-armv7l/egg/share/python-openzwave/config/leviton
copying openzwave/config/leviton/vrf01.xml -> build/bdist.linux-armv7l/egg/share/python-openzwave/config/leviton
copying openzwave/config/leviton/vri06.xml -> build/bdist.linux-armv7l/egg/share/python-openzwave/config/leviton
creating build/bdist.linux-armv7l/egg/share/python-openzwave/config/widom
copying openzwave/config/widom/UBS104.xml -> build/bdist.linux-armv7l/egg/share/python-openzwave/config/widom
creating build/bdist.linux-armv7l/egg/share/python-openzwave/config/zipato
copying openzwave/config/zipato/MiniKeypad.xml -> build/bdist.linux-armv7l/egg/share/python-openzwave/config/zipato
copying openzwave/config/zipato/RGBBulb.xml -> build/bdist.linux-armv7l/egg/share/python-openzwave/config/zipato
creating build/bdist.linux-armv7l/egg/share/python-openzwave/config/remotec
copying openzwave/config/remotec/zfm-80.xml -> build/bdist.linux-armv7l/egg/share/python-openzwave/config/remotec
copying openzwave/config/remotec/zxt-120.xml -> build/bdist.linux-armv7l/egg/share/python-openzwave/config/remotec
copying openzwave/config/remotec/zurc.xml -> build/bdist.linux-armv7l/egg/share/python-openzwave/config/remotec
creating build/bdist.linux-armv7l/egg/share/python-openzwave/config/polycontrol
copying openzwave/config/polycontrol/keypad.xml -> build/bdist.linux-armv7l/egg/share/python-openzwave/config/polycontrol
copying openzwave/config/polycontrol/doorlock.xml -> build/bdist.linux-armv7l/egg/share/python-openzwave/config/polycontrol
creating build/bdist.linux-armv7l/egg/share/python-openzwave/config/act
copying openzwave/config/act/zdw103.xml -> build/bdist.linux-armv7l/egg/share/python-openzwave/config/act
copying openzwave/config/act/zir010.xml -> build/bdist.linux-armv7l/egg/share/python-openzwave/config/act
copying openzwave/config/act/zrp110.xml -> build/bdist.linux-armv7l/egg/share/python-openzwave/config/act
copying openzwave/config/act/zrw103.xml -> build/bdist.linux-armv7l/egg/share/python-openzwave/config/act
copying openzwave/config/act/zdm230.xml -> build/bdist.linux-armv7l/egg/share/python-openzwave/config/act
copying openzwave/config/act/lfm20.xml -> build/bdist.linux-armv7l/egg/share/python-openzwave/config/act
copying openzwave/config/act/zdw232.xml -> build/bdist.linux-armv7l/egg/share/python-openzwave/config/act
creating build/bdist.linux-armv7l/egg/share/python-openzwave/config/eurotronic
copying openzwave/config/eurotronic/eur_stellaz.xml -> build/bdist.linux-armv7l/egg/share/python-openzwave/config/eurotronic
creating build/bdist.linux-armv7l/egg/share/python-openzwave/config/vision
copying openzwave/config/vision/zp3102.xml -> build/bdist.linux-armv7l/egg/share/python-openzwave/config/vision
copying openzwave/config/vision/zs5101eu.xml -> build/bdist.linux-armv7l/egg/share/python-openzwave/config/vision
copying openzwave/config/vision/zd2102.xml -> build/bdist.linux-armv7l/egg/share/python-openzwave/config/vision
copying openzwave/config/vision/zm1601eu.xml -> build/bdist.linux-armv7l/egg/share/python-openzwave/config/vision
creating build/bdist.linux-armv7l/egg/share/python-openzwave/config/waynedalton
copying openzwave/config/waynedalton/WDTC-20.xml -> build/bdist.linux-armv7l/egg/share/python-openzwave/config/waynedalton
creating build/bdist.linux-armv7l/egg/share/python-openzwave/config/everspring
copying openzwave/config/everspring/sp814.xml -> build/bdist.linux-armv7l/egg/share/python-openzwave/config/everspring
copying openzwave/config/everspring/se812.xml -> build/bdist.linux-armv7l/egg/share/python-openzwave/config/everspring
copying openzwave/config/everspring/st815.xml -> build/bdist.linux-armv7l/egg/share/python-openzwave/config/everspring
copying openzwave/config/everspring/sp103.xml -> build/bdist.linux-armv7l/egg/share/python-openzwave/config/everspring
copying openzwave/config/everspring/an145.xml -> build/bdist.linux-armv7l/egg/share/python-openzwave/config/everspring
copying openzwave/config/everspring/sf812.xml -> build/bdist.linux-armv7l/egg/share/python-openzwave/config/everspring
copying openzwave/config/everspring/sm103.xml -> build/bdist.linux-armv7l/egg/share/python-openzwave/config/everspring
copying openzwave/config/everspring/an158.xml -> build/bdist.linux-armv7l/egg/share/python-openzwave/config/everspring
copying openzwave/config/everspring/st814.xml -> build/bdist.linux-armv7l/egg/share/python-openzwave/config/everspring
copying openzwave/config/everspring/tse03.xml -> build/bdist.linux-armv7l/egg/share/python-openzwave/config/everspring
creating build/bdist.linux-armv7l/egg/share/python-openzwave/config/iris
copying openzwave/config/iris/rangeextender.xml -> build/bdist.linux-armv7l/egg/share/python-openzwave/config/iris
creating build/bdist.linux-armv7l/egg/share/python-openzwave/config/homeseer
copying openzwave/config/homeseer/hsm100.xml -> build/bdist.linux-armv7l/egg/share/python-openzwave/config/homeseer
copying openzwave/config/homeseer/ztroller.xml -> build/bdist.linux-armv7l/egg/share/python-openzwave/config/homeseer
creating build/bdist.linux-armv7l/egg/share/python-openzwave/config/qees
copying openzwave/config/qees/reto-plugin-switch.xml -> build/bdist.linux-armv7l/egg/share/python-openzwave/config/qees
creating build/bdist.linux-armv7l/egg/share/python-openzwave/config/ge
copying openzwave/config/ge/dimmer_module.xml -> build/bdist.linux-armv7l/egg/share/python-openzwave/config/ge
copying openzwave/config/ge/relay.xml -> build/bdist.linux-armv7l/egg/share/python-openzwave/config/ge
copying openzwave/config/ge/dimmer.xml -> build/bdist.linux-armv7l/egg/share/python-openzwave/config/ge
creating build/bdist.linux-armv7l/egg/share/python-openzwave/config/greenwave
copying openzwave/config/greenwave/powernode1.xml -> build/bdist.linux-armv7l/egg/share/python-openzwave/config/greenwave
copying openzwave/config/greenwave/powernode6.xml -> build/bdist.linux-armv7l/egg/share/python-openzwave/config/greenwave
creating build/bdist.linux-armv7l/egg/share/python-openzwave/config/aeon_labs
copying openzwave/config/aeon_labs/minimote.xml -> build/bdist.linux-armv7l/egg/share/python-openzwave/config/aeon_labs
copying openzwave/config/aeon_labs/recessed_doorsensor.xml -> build/bdist.linux-armv7l/egg/share/python-openzwave/config/aeon_labs
copying openzwave/config/aeon_labs/keyfob.xml -> build/bdist.linux-armv7l/egg/share/python-openzwave/config/aeon_labs
copying openzwave/config/aeon_labs/doorwindow.xml -> build/bdist.linux-armv7l/egg/share/python-openzwave/config/aeon_labs
copying openzwave/config/aeon_labs/ses.xml -> build/bdist.linux-armv7l/egg/share/python-openzwave/config/aeon_labs
copying openzwave/config/aeon_labs/hemg2.xml -> build/bdist.linux-armv7l/egg/share/python-openzwave/config/aeon_labs
copying openzwave/config/aeon_labs/ses2.xml -> build/bdist.linux-armv7l/egg/share/python-openzwave/config/aeon_labs
copying openzwave/config/aeon_labs/hem.xml -> build/bdist.linux-armv7l/egg/share/python-openzwave/config/aeon_labs
copying openzwave/config/aeon_labs/alms.xml -> build/bdist.linux-armv7l/egg/share/python-openzwave/config/aeon_labs
copying openzwave/config/aeon_labs/dsd31.xml -> build/bdist.linux-armv7l/egg/share/python-openzwave/config/aeon_labs
creating build/bdist.linux-armv7l/egg/share/python-openzwave/config/assa_abloy
Dernière édition par shad le 18 mai 2015, 23:04, édité 3 fois.

shad
Timide
Messages : 42
Inscription : 05 mai 2015, 15:13
Localisation : Paris

Re: Plugin OpenZwave

Message par shad » 18 mai 2015, 22:52

et la fin de la log :

Code : Tout sélectionner

copying openzwave/config/assa_abloy/RealLivingCapTouch.xml -> build/bdist.linux-armv7l/egg/share/python-openzwave/config/assa_abloy
creating build/bdist.linux-armv7l/egg/share/python-openzwave/config/horstmann
copying openzwave/config/horstmann/hrt4zw.xml -> build/bdist.linux-armv7l/egg/share/python-openzwave/config/horstmann
creating build/bdist.linux-armv7l/egg/share/python-openzwave/config/northq
copying openzwave/config/northq/nq92021.xml -> build/bdist.linux-armv7l/egg/share/python-openzwave/config/northq
creating build/bdist.linux-armv7l/egg/share/python-openzwave/config/zwave.me
copying openzwave/config/zwave.me/ZME_064435.xml -> build/bdist.linux-armv7l/egg/share/python-openzwave/config/zwave.me
copying openzwave/config/zwave.me/ZME_06433.xml -> build/bdist.linux-armv7l/egg/share/python-openzwave/config/zwave.me
copying openzwave/config/zwave.me/ZME_05431.xml -> build/bdist.linux-armv7l/egg/share/python-openzwave/config/zwave.me
copying openzwave/config/zwave.me/ZME_WCD2.xml -> build/bdist.linux-armv7l/egg/share/python-openzwave/config/zwave.me
copying openzwave/config/zwave.me/ZME_06436.xml -> build/bdist.linux-armv7l/egg/share/python-openzwave/config/zwave.me
copying openzwave/config/zwave.me/iTemp.xml -> build/bdist.linux-armv7l/egg/share/python-openzwave/config/zwave.me
copying openzwave/config/zwave.me/kfob.xml -> build/bdist.linux-armv7l/egg/share/python-openzwave/config/zwave.me
creating build/bdist.linux-armv7l/egg/share/python-openzwave/config/qubino
copying openzwave/config/qubino/ZMNHCA2.xml -> build/bdist.linux-armv7l/egg/share/python-openzwave/config/qubino
copying openzwave/config/qubino/ZMNHBA2.xml -> build/bdist.linux-armv7l/egg/share/python-openzwave/config/qubino
copying openzwave/config/qubino/ZMNHIA2.xml -> build/bdist.linux-armv7l/egg/share/python-openzwave/config/qubino
copying openzwave/config/qubino/ZMNHJA2.xml -> build/bdist.linux-armv7l/egg/share/python-openzwave/config/qubino
copying openzwave/config/qubino/ZMNHDA2.xml -> build/bdist.linux-armv7l/egg/share/python-openzwave/config/qubino
copying openzwave/config/qubino/ZMNHAA2.xml -> build/bdist.linux-armv7l/egg/share/python-openzwave/config/qubino
creating build/bdist.linux-armv7l/egg/share/python-openzwave/config/everspringct
copying openzwave/config/everspringct/hsm02.xml -> build/bdist.linux-armv7l/egg/share/python-openzwave/config/everspringct
creating build/bdist.linux-armv7l/egg/share/python-openzwave/config/cooper
copying openzwave/config/cooper/RF9505-T.xml -> build/bdist.linux-armv7l/egg/share/python-openzwave/config/cooper
copying openzwave/config/cooper/RF9540-N.xml -> build/bdist.linux-armv7l/egg/share/python-openzwave/config/cooper
creating build/bdist.linux-armv7l/egg/share/python-openzwave/config/rcs
copying openzwave/config/rcs/therm0005.xml -> build/bdist.linux-armv7l/egg/share/python-openzwave/config/rcs
copying openzwave/config/rcs/em52-zw.xml -> build/bdist.linux-armv7l/egg/share/python-openzwave/config/rcs
copying openzwave/config/rcs/therm0009.xml -> build/bdist.linux-armv7l/egg/share/python-openzwave/config/rcs
copying openzwave/config/rcs/pm12-zw.xml -> build/bdist.linux-armv7l/egg/share/python-openzwave/config/rcs
copying openzwave/config/rcs/therm0007.xml -> build/bdist.linux-armv7l/egg/share/python-openzwave/config/rcs
creating build/bdist.linux-armv7l/egg/share/python-openzwave/config/danfoss
copying openzwave/config/danfoss/living.xml -> build/bdist.linux-armv7l/egg/share/python-openzwave/config/danfoss
copying openzwave/config/danfoss/z.xml -> build/bdist.linux-armv7l/egg/share/python-openzwave/config/danfoss
copying openzwave/config/zwscene.xsd -> build/bdist.linux-armv7l/egg/share/python-openzwave/config
copying openzwave/config/manufacturer_specific.xsd -> build/bdist.linux-armv7l/egg/share/python-openzwave/config
copying openzwave/config/device_classes.xsd -> build/bdist.linux-armv7l/egg/share/python-openzwave/config
copying openzwave/config/zwcfg.xsd -> build/bdist.linux-armv7l/egg/share/python-openzwave/config
copying openzwave/config/options.xsd -> build/bdist.linux-armv7l/egg/share/python-openzwave/config
copying openzwave/config/device_configuration.xsd -> build/bdist.linux-armv7l/egg/share/python-openzwave/config
creating build/bdist.linux-armv7l/egg/EGG-INFO
copying python_openzwave_lib.egg-info/PKG-INFO -> build/bdist.linux-armv7l/egg/EGG-INFO
copying python_openzwave_lib.egg-info/SOURCES.txt -> build/bdist.linux-armv7l/egg/EGG-INFO
copying python_openzwave_lib.egg-info/dependency_links.txt -> build/bdist.linux-armv7l/egg/EGG-INFO
copying python_openzwave_lib.egg-info/top_level.txt -> build/bdist.linux-armv7l/egg/EGG-INFO
writing build/bdist.linux-armv7l/egg/EGG-INFO/native_libs.txt
zip_safe flag not set; analyzing archive contents...
creating dist
creating 'dist/python_openzwave_lib-0.2.6-py2.7-linux-armv7l.egg' and adding 'build/bdist.linux-armv7l/egg' to it
removing 'build/bdist.linux-armv7l/egg' (and everything under it)
Processing python_openzwave_lib-0.2.6-py2.7-linux-armv7l.egg
Removing /usr/local/lib/python2.7/dist-packages/python_openzwave_lib-0.2.6-py2.7-linux-armv7l.egg
Copying python_openzwave_lib-0.2.6-py2.7-linux-armv7l.egg to /usr/local/lib/python2.7/dist-packages
python-openzwave-lib 0.2.6 is already the active version in easy-install.pth

Installed /usr/local/lib/python2.7/dist-packages/python_openzwave_lib-0.2.6-py2.7-linux-armv7l.egg
Processing dependencies for python-openzwave-lib==0.2.6
Finished processing dependencies for python-openzwave-lib==0.2.6
sudo python setup-api.py install
running install
running bdist_egg
running egg_info
creating python_openzwave_api.egg-info
writing requirements to python_openzwave_api.egg-info/requires.txt
writing python_openzwave_api.egg-info/PKG-INFO
writing top-level names to python_openzwave_api.egg-info/top_level.txt
writing dependency_links to python_openzwave_api.egg-info/dependency_links.txt
writing manifest file 'python_openzwave_api.egg-info/SOURCES.txt'
reading manifest file 'python_openzwave_api.egg-info/SOURCES.txt'
writing manifest file 'python_openzwave_api.egg-info/SOURCES.txt'
installing library code to build/bdist.linux-armv7l/egg
running install_lib
running build_py
creating build/bdist.linux-armv7l/egg
creating build/bdist.linux-armv7l/egg/pyozwman
copying build/lib.linux-armv7l-2.7/pyozwman/ozwsh_widgets.py -> build/bdist.linux-armv7l/egg/pyozwman
copying build/lib.linux-armv7l-2.7/pyozwman/__init__.py -> build/bdist.linux-armv7l/egg/pyozwman
copying build/lib.linux-armv7l-2.7/pyozwman/ozwsh.py -> build/bdist.linux-armv7l/egg/pyozwman
copying build/lib.linux-armv7l-2.7/libopenzwave.so -> build/bdist.linux-armv7l/egg
creating build/bdist.linux-armv7l/egg/openzwave
copying build/lib.linux-armv7l-2.7/openzwave/object.py -> build/bdist.linux-armv7l/egg/openzwave
copying build/lib.linux-armv7l-2.7/openzwave/group.py -> build/bdist.linux-armv7l/egg/openzwave
copying build/lib.linux-armv7l-2.7/openzwave/scene.py -> build/bdist.linux-armv7l/egg/openzwave
copying build/lib.linux-armv7l-2.7/openzwave/option.py -> build/bdist.linux-armv7l/egg/openzwave
copying build/lib.linux-armv7l-2.7/openzwave/controller.py -> build/bdist.linux-armv7l/egg/openzwave
copying build/lib.linux-armv7l-2.7/openzwave/value.py -> build/bdist.linux-armv7l/egg/openzwave
copying build/lib.linux-armv7l-2.7/openzwave/__init__.py -> build/bdist.linux-armv7l/egg/openzwave
copying build/lib.linux-armv7l-2.7/openzwave/network.py -> build/bdist.linux-armv7l/egg/openzwave
copying build/lib.linux-armv7l-2.7/openzwave/command.py -> build/bdist.linux-armv7l/egg/openzwave
copying build/lib.linux-armv7l-2.7/openzwave/node.py -> build/bdist.linux-armv7l/egg/openzwave
byte-compiling build/bdist.linux-armv7l/egg/pyozwman/ozwsh_widgets.py to ozwsh_widgets.pyc
byte-compiling build/bdist.linux-armv7l/egg/pyozwman/__init__.py to __init__.pyc
byte-compiling build/bdist.linux-armv7l/egg/pyozwman/ozwsh.py to ozwsh.pyc
byte-compiling build/bdist.linux-armv7l/egg/openzwave/object.py to object.pyc
byte-compiling build/bdist.linux-armv7l/egg/openzwave/group.py to group.pyc
byte-compiling build/bdist.linux-armv7l/egg/openzwave/scene.py to scene.pyc
byte-compiling build/bdist.linux-armv7l/egg/openzwave/option.py to option.pyc
byte-compiling build/bdist.linux-armv7l/egg/openzwave/controller.py to controller.pyc
byte-compiling build/bdist.linux-armv7l/egg/openzwave/value.py to value.pyc
byte-compiling build/bdist.linux-armv7l/egg/openzwave/__init__.py to __init__.pyc
byte-compiling build/bdist.linux-armv7l/egg/openzwave/network.py to network.pyc
byte-compiling build/bdist.linux-armv7l/egg/openzwave/command.py to command.pyc
byte-compiling build/bdist.linux-armv7l/egg/openzwave/node.py to node.pyc
installing package data to build/bdist.linux-armv7l/egg
running install_data
creating build/bdist.linux-armv7l/egg/share
creating build/bdist.linux-armv7l/egg/share/doc
creating build/bdist.linux-armv7l/egg/share/doc/python-openzwave
copying docs/_build/html/libopenzwave.html -> build/bdist.linux-armv7l/egg/share/doc/python-openzwave
copying docs/_build/html/value.html -> build/bdist.linux-armv7l/egg/share/doc/python-openzwave
copying docs/_build/html/hello_world.html -> build/bdist.linux-armv7l/egg/share/doc/python-openzwave
copying docs/_build/html/_index_txt.html -> build/bdist.linux-armv7l/egg/share/doc/python-openzwave
copying docs/_build/html/EXAMPLES.html -> build/bdist.linux-armv7l/egg/share/doc/python-openzwave
copying docs/_build/html/data.html -> build/bdist.linux-armv7l/egg/share/doc/python-openzwave
copying docs/_build/html/README.html -> build/bdist.linux-armv7l/egg/share/doc/python-openzwave
copying docs/_build/html/group.html -> build/bdist.linux-armv7l/egg/share/doc/python-openzwave
copying docs/_build/html/node.html -> build/bdist.linux-armv7l/egg/share/doc/python-openzwave
copying docs/_build/html/diagrams.html -> build/bdist.linux-armv7l/egg/share/doc/python-openzwave
copying docs/_build/html/object.html -> build/bdist.linux-armv7l/egg/share/doc/python-openzwave
copying docs/_build/html/option.html -> build/bdist.linux-armv7l/egg/share/doc/python-openzwave
copying docs/_build/html/_index_api.html -> build/bdist.linux-armv7l/egg/share/doc/python-openzwave
copying docs/_build/html/DEVEL.html -> build/bdist.linux-armv7l/egg/share/doc/python-openzwave
copying docs/_build/html/index.html -> build/bdist.linux-armv7l/egg/share/doc/python-openzwave
copying docs/_build/html/scene.html -> build/bdist.linux-armv7l/egg/share/doc/python-openzwave
copying docs/_build/html/_index_lib.html -> build/bdist.linux-armv7l/egg/share/doc/python-openzwave
copying docs/_build/html/command.html -> build/bdist.linux-armv7l/egg/share/doc/python-openzwave
copying docs/_build/html/api.html -> build/bdist.linux-armv7l/egg/share/doc/python-openzwave
copying docs/_build/html/controller.html -> build/bdist.linux-armv7l/egg/share/doc/python-openzwave
copying docs/_build/html/network.html -> build/bdist.linux-armv7l/egg/share/doc/python-openzwave
copying docs/_build/html/INSTALL_REPO.html -> build/bdist.linux-armv7l/egg/share/doc/python-openzwave
copying docs/_build/html/search.html -> build/bdist.linux-armv7l/egg/share/doc/python-openzwave
copying docs/_build/html/openzwave.html -> build/bdist.linux-armv7l/egg/share/doc/python-openzwave
copying docs/_build/html/genindex.html -> build/bdist.linux-armv7l/egg/share/doc/python-openzwave
copying docs/_build/html/py-modindex.html -> build/bdist.linux-armv7l/egg/share/doc/python-openzwave
copying docs/_build/html/COPYRIGHT.html -> build/bdist.linux-armv7l/egg/share/doc/python-openzwave
copying docs/_build/html/INSTALL_MAN.html -> build/bdist.linux-armv7l/egg/share/doc/python-openzwave
copying docs/_build/html/INSTALL_ARCH.html -> build/bdist.linux-armv7l/egg/share/doc/python-openzwave
creating build/bdist.linux-armv7l/egg/share/doc/python-openzwave/_sources
creating build/bdist.linux-armv7l/egg/share/doc/python-openzwave/_static
creating build/bdist.linux-armv7l/egg/share/doc/python-openzwave/_images
copying docs/_build/html/searchindex.js -> build/bdist.linux-armv7l/egg/share/doc/python-openzwave
copying docs/_build/html/_static/underscore.js -> build/bdist.linux-armv7l/egg/share/doc/python-openzwave/_static
copying docs/_build/html/_static/doctools.js -> build/bdist.linux-armv7l/egg/share/doc/python-openzwave/_static
copying docs/_build/html/_static/searchtools.js -> build/bdist.linux-armv7l/egg/share/doc/python-openzwave/_static
copying docs/_build/html/_static/websupport.js -> build/bdist.linux-armv7l/egg/share/doc/python-openzwave/_static
copying docs/_build/html/_static/sidebar.js -> build/bdist.linux-armv7l/egg/share/doc/python-openzwave/_static
copying docs/_build/html/_static/jquery.js -> build/bdist.linux-armv7l/egg/share/doc/python-openzwave/_static
copying docs/_build/html/_sources/_index_txt.txt -> build/bdist.linux-armv7l/egg/share/doc/python-openzwave/_sources
copying docs/_build/html/_sources/_index_api.txt -> build/bdist.linux-armv7l/egg/share/doc/python-openzwave/_sources
copying docs/_build/html/_sources/command.txt -> build/bdist.linux-armv7l/egg/share/doc/python-openzwave/_sources
copying docs/_build/html/_sources/controller.txt -> build/bdist.linux-armv7l/egg/share/doc/python-openzwave/_sources
copying docs/_build/html/_sources/scene.txt -> build/bdist.linux-armv7l/egg/share/doc/python-openzwave/_sources
copying docs/_build/html/_sources/option.txt -> build/bdist.linux-armv7l/egg/share/doc/python-openzwave/_sources
copying docs/_build/html/_sources/DEVEL.txt -> build/bdist.linux-armv7l/egg/share/doc/python-openzwave/_sources
copying docs/_build/html/_sources/_index_lib.txt -> build/bdist.linux-armv7l/egg/share/doc/python-openzwave/_sources
copying docs/_build/html/_sources/group.txt -> build/bdist.linux-armv7l/egg/share/doc/python-openzwave/_sources
copying docs/_build/html/_sources/COPYRIGHT.txt -> build/bdist.linux-armv7l/egg/share/doc/python-openzwave/_sources
copying docs/_build/html/_sources/libopenzwave.txt -> build/bdist.linux-armv7l/egg/share/doc/python-openzwave/_sources
copying docs/_build/html/_sources/node.txt -> build/bdist.linux-armv7l/egg/share/doc/python-openzwave/_sources
copying docs/_build/html/_sources/README.txt -> build/bdist.linux-armv7l/egg/share/doc/python-openzwave/_sources
copying docs/_build/html/_sources/diagrams.txt -> build/bdist.linux-armv7l/egg/share/doc/python-openzwave/_sources
copying docs/_build/html/_sources/hello_world.txt -> build/bdist.linux-armv7l/egg/share/doc/python-openzwave/_sources
copying docs/_build/html/_sources/INSTALL_ARCH.txt -> build/bdist.linux-armv7l/egg/share/doc/python-openzwave/_sources
copying docs/_build/html/_sources/api.txt -> build/bdist.linux-armv7l/egg/share/doc/python-openzwave/_sources
copying docs/_build/html/_sources/EXAMPLES.txt -> build/bdist.linux-armv7l/egg/share/doc/python-openzwave/_sources
copying docs/_build/html/_sources/openzwave.txt -> build/bdist.linux-armv7l/egg/share/doc/python-openzwave/_sources
copying docs/_build/html/_sources/INSTALL_MAN.txt -> build/bdist.linux-armv7l/egg/share/doc/python-openzwave/_sources
copying docs/_build/html/_sources/index.txt -> build/bdist.linux-armv7l/egg/share/doc/python-openzwave/_sources
copying docs/_build/html/_sources/INSTALL_REPO.txt -> build/bdist.linux-armv7l/egg/share/doc/python-openzwave/_sources
copying docs/_build/html/_sources/network.txt -> build/bdist.linux-armv7l/egg/share/doc/python-openzwave/_sources
copying docs/_build/html/_sources/data.txt -> build/bdist.linux-armv7l/egg/share/doc/python-openzwave/_sources
copying docs/_build/html/_sources/value.txt -> build/bdist.linux-armv7l/egg/share/doc/python-openzwave/_sources
copying docs/_build/html/_sources/object.txt -> build/bdist.linux-armv7l/egg/share/doc/python-openzwave/_sources
copying docs/_build/html/_static/comment.png -> build/bdist.linux-armv7l/egg/share/doc/python-openzwave/_static
copying docs/_build/html/_static/down.png -> build/bdist.linux-armv7l/egg/share/doc/python-openzwave/_static
copying docs/_build/html/_static/minus.png -> build/bdist.linux-armv7l/egg/share/doc/python-openzwave/_static
copying docs/_build/html/_static/comment-bright.png -> build/bdist.linux-armv7l/egg/share/doc/python-openzwave/_static
copying docs/_build/html/_static/down-pressed.png -> build/bdist.linux-armv7l/egg/share/doc/python-openzwave/_static
copying docs/_build/html/_static/plus.png -> build/bdist.linux-armv7l/egg/share/doc/python-openzwave/_static
copying docs/_build/html/_static/file.png -> build/bdist.linux-armv7l/egg/share/doc/python-openzwave/_static
copying docs/_build/html/_static/comment-close.png -> build/bdist.linux-armv7l/egg/share/doc/python-openzwave/_static
copying docs/_build/html/_static/up-pressed.png -> build/bdist.linux-armv7l/egg/share/doc/python-openzwave/_static
copying docs/_build/html/_static/up.png -> build/bdist.linux-armv7l/egg/share/doc/python-openzwave/_static
copying docs/_build/html/_images/blockdiag_thumb-ad738ccbf1111a92e761a710d8e22534a9076e97.png -> build/bdist.linux-armv7l/egg/share/doc/python-openzwave/_images
copying docs/_build/html/_images/blockdiag-b718f1ff7a0a1da53e9456b76ce5e452102efcee.png -> build/bdist.linux-armv7l/egg/share/doc/python-openzwave/_images
copying docs/_build/html/_static/basic.css -> build/bdist.linux-armv7l/egg/share/doc/python-openzwave/_static
copying docs/_build/html/_static/pygments.css -> build/bdist.linux-armv7l/egg/share/doc/python-openzwave/_static
copying docs/_build/html/_static/default.css -> build/bdist.linux-armv7l/egg/share/doc/python-openzwave/_static
copying docs/_build/html/_static/ajax-loader.gif -> build/bdist.linux-armv7l/egg/share/doc/python-openzwave/_static
creating build/bdist.linux-armv7l/egg/EGG-INFO
copying python_openzwave_api.egg-info/PKG-INFO -> build/bdist.linux-armv7l/egg/EGG-INFO
copying python_openzwave_api.egg-info/SOURCES.txt -> build/bdist.linux-armv7l/egg/EGG-INFO
copying python_openzwave_api.egg-info/dependency_links.txt -> build/bdist.linux-armv7l/egg/EGG-INFO
copying python_openzwave_api.egg-info/requires.txt -> build/bdist.linux-armv7l/egg/EGG-INFO
copying python_openzwave_api.egg-info/top_level.txt -> build/bdist.linux-armv7l/egg/EGG-INFO
writing build/bdist.linux-armv7l/egg/EGG-INFO/native_libs.txt
zip_safe flag not set; analyzing archive contents...
creating 'dist/python_openzwave_api-0.2.6-py2.7.egg' and adding 'build/bdist.linux-armv7l/egg' to it
removing 'build/bdist.linux-armv7l/egg' (and everything under it)
Processing python_openzwave_api-0.2.6-py2.7.egg
Removing /usr/local/lib/python2.7/dist-packages/python_openzwave_api-0.2.6-py2.7.egg
Copying python_openzwave_api-0.2.6-py2.7.egg to /usr/local/lib/python2.7/dist-packages
python-openzwave-api 0.2.6 is already the active version in easy-install.pth

Installed /usr/local/lib/python2.7/dist-packages/python_openzwave_api-0.2.6-py2.7.egg
Processing dependencies for python-openzwave-api==0.2.6
Traceback (most recent call last):
  File "setup-api.py", line 84, in <module>
    install_requires=[ dispatch_package ]
  File "/usr/lib/python2.7/distutils/core.py", line 151, in setup
    dist.run_commands()
  File "/usr/lib/python2.7/distutils/dist.py", line 953, in run_commands
    self.run_command(cmd)
  File "/usr/lib/python2.7/distutils/dist.py", line 972, in run_command
    cmd_obj.run()
  File "/usr/lib/python2.7/dist-packages/setuptools/command/install.py", line 73, in run
    self.do_egg_install()
  File "/usr/lib/python2.7/dist-packages/setuptools/command/install.py", line 96, in do_egg_install
    cmd.run()
  File "/usr/lib/python2.7/dist-packages/setuptools/command/easy_install.py", line 381, in run
    self.easy_install(spec, not self.no_deps)
  File "/usr/lib/python2.7/dist-packages/setuptools/command/easy_install.py", line 597, in easy_install
    return self.install_item(None, spec, tmpdir, deps, True)
  File "/usr/lib/python2.7/dist-packages/setuptools/command/easy_install.py", line 648, in install_item
    self.process_distribution(spec, dist, deps)
  File "/usr/lib/python2.7/dist-packages/setuptools/command/easy_install.py", line 694, in process_distribution
    [requirement], self.local_index, self.easy_install
  File "/usr/lib/python2.7/dist-packages/pkg_resources.py", line 633, in resolve
    requirements.extend(dist.requires(req.extras)[::-1])
  File "/usr/lib/python2.7/dist-packages/pkg_resources.py", line 2291, in requires
    dm = self._dep_map
  File "/usr/lib/python2.7/dist-packages/pkg_resources.py", line 2277, in _dep_map
    for extra,reqs in split_sections(self._get_metadata(name)):
  File "/usr/lib/python2.7/dist-packages/pkg_resources.py", line 2715, in split_sections
    for line in yield_lines(s):
  File "/usr/lib/python2.7/dist-packages/pkg_resources.py", line 1989, in yield_lines
    for ss in strs:
  File "/usr/lib/python2.7/dist-packages/pkg_resources.py", line 2305, in _get_metadata
    for line in self.get_metadata_lines(name):
  File "/usr/lib/python2.7/dist-packages/pkg_resources.py", line 1369, in get_metadata_lines
    return yield_lines(self.get_metadata(name))
  File "/usr/lib/python2.7/dist-packages/pkg_resources.py", line 1361, in get_metadata
    return self._get(self._fn(self.egg_info,name))
  File "/usr/lib/python2.7/dist-packages/pkg_resources.py", line 1425, in _get
    return self.loader.get_data(path)
zipimport.ZipImportError: bad local file header in /usr/local/lib/python2.7/dist-packages/python_openzwave_api-0.2.6-py2.7.egg
make: *** [install] Error 1
Everything is successfully installed!

Guik
Timide
Messages : 6
Inscription : 19 mai 2015, 19:24

Re: Plugin OpenZwave

Message par Guik » 19 mai 2015, 19:28

Avant d'acheter le plugin j'aimerais savoir si celui-ci peut fonctionner sur un Jeedom tournant sur Docker ?
Existe-il une version de demo du plugin pour pouvoir tester ?

Merci !

Avatar de l’utilisateur
tmartinez
Modérateur
Messages : 1226
Inscription : 08 juil. 2014, 11:22
Localisation : Limonest

Re: Plugin OpenZwave

Message par tmartinez » 19 mai 2015, 23:11

@shad : je pense qu'il va falloir désinstaller proprement openzwave.
Tu peux faire les commandes suivantes :

Code : Tout sélectionner

cd /opt/python-openzwave
sudo ./uninstall.sh
cd /
sudo rm -Rf /opt/python-openzwave
Puis relancer l'installation.

@Guik :
Il n'est pas possible d'avoir une version d'essai. Concernant la compatibilité avec Docker, Sarakha63 a testé et normalement c'est bon.
Sinon nechry (co-développeur du plugin) est en cours de migration vers cette configuration, il pourra rapidement nous faire un retour dessus.
Jeedom sous Proxmox
43 Modules Z-Wave / 1x RfxCom / 20 devices connectés
Mon matériel

Guik
Timide
Messages : 6
Inscription : 19 mai 2015, 19:24

Re: Plugin OpenZwave

Message par Guik » 19 mai 2015, 23:35

Merci pour les informations !
@sarakha63 Je compte utiliser ma clee SIGMA DESIGNS et faire tourner Jeedom sur mon synology via docker.

Première difficulté impossible d’accéder au fichier "http://127.0.0.1:8080/jeedom/plugins/op ... install.sh" ngninx retourne une 404, une idée ou je peut trouver celui-ci via le shell linux ?

shad
Timide
Messages : 42
Inscription : 05 mai 2015, 15:13
Localisation : Paris

Re: Plugin OpenZwave

Message par shad » 20 mai 2015, 02:26

@tmartinez
Le script de désinstallation me donne : "Can't find install.files. Abort !!"
Du coup j'ai été faire les rm qui étaient dans le script et re fait l'installation, ça marche sans erreur :P

Merci !

Guik
Timide
Messages : 6
Inscription : 19 mai 2015, 19:24

Re: Plugin OpenZwave

Message par Guik » 21 mai 2015, 09:05

sarakha63 a écrit :usr/share/nginx/www/jeedom/openzwave/ressources
Tu as bien executé la commande dans le ssh du docker ?
Oui depuis le ssh docker, mais j'ai réussi à contourner en le prenant via le path system. Merci !

Je confirme ça fonctionne parfaitement sous Docker, juste dans le cas de docker sous Synology le paramètres device n'est pas supporte depuis l'interface il faut alors lancer notre instance docker manuellement depuis le ssh du Nas avec les paramètres nécessaires .

Avatar de l’utilisateur
alientouch
Timide
Messages : 314
Inscription : 07 août 2014, 23:07

Re: Plugin OpenZwave

Message par alientouch » 28 mai 2015, 22:48

Bonjour,
J'avais un razberry avec serveur zway, j'ai désinstallé zway via la procédure du wiki openzwave
Ensuite j'ai installé openzwave, configuré le plugin avec ma cle z-stick 2, j'ai inclus un périphérique en débranchant le stick ok mais impossible de le récupérer dans Jeedom, qqun pour m'aider svp ?
Raspberry Pi 3 + SSD : Jeedom 3.3.19
Dongle Z-Wave : Aeotec Z-Stick Gen 5
Passerrelle 433 Mhz : RFXcom RFXtrx433
Mon matériel

Répondre

Revenir vers « Plugin Z-Wave »

Qui est en ligne ?

Utilisateurs parcourant ce forum : Aucun utilisateur inscrit et 2 invités