Ce Forum passera en lecture seule en janvier 2020
Image
Merci de vous rendre sur https://community.jeedom.com maintenant pour vos prochains postes ;)

[Plugin Tiers][Sujet Principal] Google Cast

Pour échanger sur les plugins classés en catégorie "Multimédia"
Boulet
Timide
Messages : 11
Inscription : 19 févr. 2019, 17:12

Re: [Plugin Tiers][Sujet Principal] Google Cast

Message par Boulet » 21 mai 2019, 11:58

Bonjour à tous,
Nouvel utilisateur du plugin, j'essaye de le faire fonctionner sur mon sonos avec google assistant.
A priori il n'est pas détecté.
Quelqu'un a t il deja essayé d'utiliser le plugin avec le google du sonos?
Merci pour vos retours
(je vais ressortir mon galet pour tester que c'est pas un problème de conf du plugin).

Avatar de l’utilisateur
Antoinekl1
Actif
Messages : 3927
Inscription : 23 mai 2015, 08:14

Re: [Plugin Tiers][Sujet Principal] Google Cast

Message par Antoinekl1 » 23 mai 2019, 15:25

Bonjour à tous

depuis quelques temps, pour certains messages, la voix en sortie de la google home est complètement déformée, avez vous aussi ce problème ?
JEEDOM Smart Ultimate + 40 modules zwave
A vendre ; pack POWER jeedom - Jeedom Mini+ - Console Clazio sous Android 6

Avatar de l’utilisateur
breizh22
Actif
Messages : 1318
Inscription : 10 oct. 2015, 17:35

Re: [Plugin Tiers][Sujet Principal] Google Cast

Message par breizh22 » 23 mai 2019, 15:32

Non, tout fonctionne très bien pour ma part. Aucun souci de voix.

Efface le cache du plugin pour voir.
HP Gen 8 / OMV4 sur SSD / Jeedom 3.3.37 VM Debian 9
RFLink - Sondes Oregon THN 132 N / THGR 122 NX / THGR 810 / THC238 - Prises DIO/Dedra/IDK.
Orvibo AllOne et S20 - Onduleur APC Back-UPS ES 700VA
Écosystème xiaomi - Dash buttons - GHome et mini.

Avatar de l’utilisateur
Antoinekl1
Actif
Messages : 3927
Inscription : 23 mai 2015, 08:14

Re: [Plugin Tiers][Sujet Principal] Google Cast

Message par Antoinekl1 » 24 mai 2019, 07:41

breizh22 a écrit :
23 mai 2019, 15:32
Non, tout fonctionne très bien pour ma part. Aucun souci de voix.

Efface le cache du plugin pour voir.
Ok,,c'est arrivé 3-4 fois et j'avais vidé le cache, merci
JEEDOM Smart Ultimate + 40 modules zwave
A vendre ; pack POWER jeedom - Jeedom Mini+ - Console Clazio sous Android 6

raphael_malin
Timide
Messages : 481
Inscription : 10 nov. 2014, 00:20
Localisation : Nouméa - Nouvelle-Calédonie

Re: [Plugin Tiers][Sujet Principal] Google Cast

Message par raphael_malin » 25 mai 2019, 10:51

Hello, je n'ai plus d'image qui s'affiche dans la partie centrale de la tuile. il n'y a que le dessin du chromecast. Si je mets une radio, cela n'affiche plus le logo de la radio avant cela fonctionnait. pourquoi ?
Merci
Jeedom smart avec en général toutes les mises à jour faites (système et plugin)

Pitt13
Timide
Messages : 79
Inscription : 24 juin 2014, 22:19

Re: [Plugin Tiers][Sujet Principal] Google Cast

Message par Pitt13 » 26 mai 2019, 10:37

Salut a tous,
Est-ce possible de régler Le volume de la fonction "Parle" dans un scénario ?
VeraPlus + JeedomSmart zwave+
Installation Z-Wave
Installation Multimédia avec pilotage infrarouge Kira128
Tablette Galaxy Tab 3

Pitt13
Timide
Messages : 79
Inscription : 24 juin 2014, 22:19

Re: [Plugin Tiers][Sujet Principal] Google Cast

Message par Pitt13 » 28 mai 2019, 19:53

Salut a tous
Personne n'a fait ce type de scénario ????
VeraPlus + JeedomSmart zwave+
Installation Z-Wave
Installation Multimédia avec pilotage infrarouge Kira128
Tablette Galaxy Tab 3

Pitt13
Timide
Messages : 79
Inscription : 24 juin 2014, 22:19

Re: [Plugin Tiers][Sujet Principal] Google Cast

Message par Pitt13 » 28 mai 2019, 22:26

Salut,
Merci ça fonctionne nickel 😀😀😀
VeraPlus + JeedomSmart zwave+
Installation Z-Wave
Installation Multimédia avec pilotage infrarouge Kira128
Tablette Galaxy Tab 3

Heracles44
Actif
Messages : 518
Inscription : 23 juil. 2018, 13:06

Re: [Plugin Tiers][Sujet Principal] Google Cast

Message par Heracles44 » 30 mai 2019, 19:54

Bonjour,
J’ai une TV LG connectée que j’utilise déjà avec le plugin WebTV OS.
Y a une app dessus que s’appelle Vidéo Cast. Quand j’ouvre YouTube ça me trouve directement ma TV! Par contre, ça ne la trouve pas sur le plugin Google Cast sur Jeedom! Ma TV est branchée sur mon routeur 4G en Wifi. Jeedom est en Wifi sur ce même routeur et en ethernet sur le routeur ADSL!
Pouvez vous faire une mise à jour pour pouvoir ajouter ma TV comme équipement pouvant recevoir un Cast?

sim2000
Timide
Messages : 65
Inscription : 08 avr. 2018, 23:19

Re: [Plugin Tiers][Sujet Principal] Google Cast

Message par sim2000 » 02 juin 2019, 16:47

Bonjour à tous,

Je viens d'installer le plugin mais j'ai un soucis, je n'arrive pas à installer les dépendances, cela charge bien jusqu'à 100% mais j'ai toujours NOK.

Voici le log:

Code : Tout sélectionner

Launch install of googlecast dependancies

-- Updating repo...
Hit http://repo.jeedom.com stable InRelease
Ign http://ftp.debian.org jessie InRelease
Hit http://ftp.debian.org jessie-updates InRelease
Ign http://ftp.debian.org jessie-backports InRelease
Ign http://ftp.debian.org jessie-proposed-updates InRelease
Hit http://repo.jeedom.com stable/main arm64 Packages
Hit http://ftp.debian.org jessie Release.gpg
Ign http://ftp.debian.org jessie-backports Release.gpg
Hit http://security.debian.org jessie/updates InRelease
Ign http://ftp.debian.org jessie-proposed-updates Release.gpg
Ign http://repo.jeedom.com stable/main Translation-en_US
Ign http://repo.jeedom.com stable/main Translation-en
Hit http://ftp.debian.org jessie Release
Hit https://raspbian.snips.ai stable InRelease
Ign http://ftp.debian.org jessie-backports Release
Ign http://ftp.debian.org jessie-proposed-updates Release
Get:1 http://security.debian.org jessie/updates/main Sources [318 kB]
Ign http://ftp.debian.org jessie-backports/main Sources/DiffIndex
Ign http://ftp.debian.org jessie-backports/contrib Sources/DiffIndex
Ign http://ftp.debian.org jessie-backports/non-free Sources/DiffIndex
Ign http://ftp.debian.org jessie-backports/main arm64 Packages/DiffIndex
Get:2 http://security.debian.org jessie/updates/non-free Sources [1,626 B]
Hit http://security.debian.org jessie/updates/contrib Sources
Ign http://ftp.debian.org jessie-backports/contrib arm64 Packages/DiffIndex
Ign http://ftp.debian.org jessie-backports/non-free arm64 Packages/DiffIndex
Hit http://oph.mdrjr.net all InRelease
Hit http://oph.mdrjr.net jessie InRelease
Get:3 http://oph.mdrjr.net all/c2 arm64 Packages
Get:4 http://oph.mdrjr.net all/main arm64 Packages
Hit http://oph.mdrjr.net all/c2 arm64 Packages
Get:5 http://oph.mdrjr.net all/testing arm64 Packages
Ign http://ftp.debian.org jessie-proposed-updates/contrib Sources/DiffIndex
Ign http://ftp.debian.org jessie-proposed-updates/non-free Sources/DiffIndex
Hit http://oph.mdrjr.net all/main arm64 Packages
Ign http://ftp.debian.org jessie-proposed-updates/main Sources/DiffIndex
Ign http://ftp.debian.org jessie-proposed-updates/contrib arm64 Packages/DiffIndex
Ign http://ftp.debian.org jessie-proposed-updates/non-free arm64 Packages/DiffIndex
Get:6 http://oph.mdrjr.net all/c2 Translation-en_US [324 B]
Ign http://ftp.debian.org jessie-proposed-updates/main arm64 Packages/DiffIndex
Get:7 http://oph.mdrjr.net all/c2 Translation-en [321 B]
Hit http://oph.mdrjr.net all/testing arm64 Packages
Get:8 http://oph.mdrjr.net all/main Translation-en_US [326 B]
Get:9 http://oph.mdrjr.net all/main Translation-en [323 B]
Hit http://ftp.debian.org jessie/main Sources
Hit http://ftp.debian.org jessie/contrib Sources
Hit http://ftp.debian.org jessie/non-free Sources
Get:10 http://oph.mdrjr.net all/testing Translation-en_US [329 B]
Get:11 http://oph.mdrjr.net all/testing Translation-en [326 B]
Get:12 http://oph.mdrjr.net jessie/backports arm64 Packages
Hit http://ftp.debian.org jessie/contrib Translation-en
Hit http://ftp.debian.org jessie/main Translation-en
Get:13 http://oph.mdrjr.net jessie/main arm64 Packages
Hit http://ftp.debian.org jessie/non-free Translation-en
Get:14 http://oph.mdrjr.net jessie/backports Translation-en_US [334 B]
Get:15 http://oph.mdrjr.net jessie/backports Translation-en [331 B]
Get:16 http://oph.mdrjr.net jessie/main Translation-en_US [329 B]
Get:17 http://oph.mdrjr.net jessie/main Translation-en [326 B]
Get:18 http://oph.mdrjr.net all/c2 Translation-en_US [324 B]
Get:19 http://oph.mdrjr.net all/c2 Translation-en [321 B]
Get:20 http://oph.mdrjr.net all/main Translation-en_US [326 B]
Hit http://oph.mdrjr.net jessie/backports arm64 Packages
Get:21 http://oph.mdrjr.net all/main Translation-en [323 B]
Hit http://oph.mdrjr.net jessie/main arm64 Packages
Err http://ftp.debian.org jessie/main arm64 Packages
  404  Not Found [IP: 130.89.148.12 80]
Get:22 http://oph.mdrjr.net all/testing Translation-en_US [329 B]
Err http://ftp.debian.org jessie/contrib arm64 Packages
  404  Not Found [IP: 130.89.148.12 80]
Err http://ftp.debian.org jessie/non-free arm64 Packages
  404  Not Found [IP: 130.89.148.12 80]
Get:23 http://oph.mdrjr.net all/testing Translation-en [326 B]
Get:24 http://oph.mdrjr.net jessie/backports Translation-en_US [334 B]
Get:25 http://oph.mdrjr.net jessie/backports Translation-en [331 B]
Get:26 http://oph.mdrjr.net jessie/main Translation-en_US [329 B]
Get:27 http://oph.mdrjr.net jessie/main Translation-en [326 B]
Get:28 http://oph.mdrjr.net all/c2 Translation-en_US [324 B]
Get:29 http://oph.mdrjr.net all/c2 Translation-en [321 B]
Get:30 http://oph.mdrjr.net all/main Translation-en_US [326 B]
Get:31 http://oph.mdrjr.net all/main Translation-en [323 B]
Get:32 http://oph.mdrjr.net all/testing Translation-en_US [329 B]
Get:33 http://oph.mdrjr.net all/testing Translation-en [326 B]
Get:34 http://oph.mdrjr.net jessie/backports Translation-en_US [334 B]
Get:35 http://oph.mdrjr.net jessie/backports Translation-en [331 B]
Get:36 http://oph.mdrjr.net jessie/main Translation-en_US [329 B]
Get:37 http://oph.mdrjr.net jessie/main Translation-en [326 B]
Get:38 http://oph.mdrjr.net all/c2 Translation-en_US [324 B]
Get:39 http://oph.mdrjr.net all/c2 Translation-en [321 B]
Get:40 http://oph.mdrjr.net all/main Translation-en_US [326 B]
Get:41 http://oph.mdrjr.net all/main Translation-en [323 B]
Get:42 http://oph.mdrjr.net all/testing Translation-en_US [329 B]
Ign http://ftp.debian.org jessie-backports/contrib Translation-en_US
Ign http://ftp.debian.org jessie-backports/contrib Translation-en
Ign http://ftp.debian.org jessie-backports/main Translation-en_US
Get:43 http://oph.mdrjr.net all/testing Translation-en [326 B]
Ign http://ftp.debian.org jessie-backports/main Translation-en
Ign http://ftp.debian.org jessie-backports/non-free Translation-en_US
Get:44 http://oph.mdrjr.net jessie/backports Translation-en_US [334 B]
Ign http://ftp.debian.org jessie-backports/non-free Translation-en
Get:45 http://oph.mdrjr.net jessie/backports Translation-en [331 B]
Get:46 http://oph.mdrjr.net jessie/main Translation-en_US [329 B]
Get:47 http://oph.mdrjr.net jessie/main Translation-en [326 B]
Ign http://ftp.debian.org jessie-proposed-updates/contrib Translation-en_US
Get:48 http://oph.mdrjr.net all/c2 Translation-en_US [324 B]
Ign http://oph.mdrjr.net all/c2 Translation-en_US
Ign http://ftp.debian.org jessie-proposed-updates/contrib Translation-en
Ign http://ftp.debian.org jessie-proposed-updates/main Translation-en_US
Ign http://ftp.debian.org jessie-proposed-updates/main Translation-en
Get:49 http://oph.mdrjr.net all/c2 Translation-en [321 B]
Ign http://oph.mdrjr.net all/c2 Translation-en
Ign http://ftp.debian.org jessie-proposed-updates/non-free Translation-en_US
Ign http://ftp.debian.org jessie-proposed-updates/non-free Translation-en
Get:50 http://oph.mdrjr.net all/main Translation-en_US [326 B]
Ign http://oph.mdrjr.net all/main Translation-en_US
Err http://ftp.debian.org jessie-backports/main Sources
  404  Not Found [IP: 130.89.148.12 80]
Err http://ftp.debian.org jessie-backports/contrib Sources
  404  Not Found [IP: 130.89.148.12 80]
Err http://ftp.debian.org jessie-backports/non-free Sources
  404  Not Found [IP: 130.89.148.12 80]
Get:51 http://oph.mdrjr.net all/main Translation-en [323 B]
Ign http://oph.mdrjr.net all/main Translation-en
Err http://ftp.debian.org jessie-backports/main arm64 Packages
  404  Not Found [IP: 130.89.148.12 80]
Err http://ftp.debian.org jessie-backports/contrib arm64 Packages
  404  Not Found [IP: 130.89.148.12 80]
Get:52 http://oph.mdrjr.net all/testing Translation-en_US [329 B]
Ign http://oph.mdrjr.net all/testing Translation-en_US
Err http://ftp.debian.org jessie-backports/non-free arm64 Packages
  404  Not Found [IP: 130.89.148.12 80]
Get:53 http://oph.mdrjr.net all/testing Translation-en [326 B]
Ign http://oph.mdrjr.net all/testing Translation-en
Err http://ftp.debian.org jessie-proposed-updates/contrib Sources
  404  Not Found [IP: 130.89.148.12 80]
Err http://ftp.debian.org jessie-proposed-updates/non-free Sources
  404  Not Found [IP: 130.89.148.12 80]
Get:54 http://oph.mdrjr.net jessie/backports Translation-en_US [334 B]
Ign http://oph.mdrjr.net jessie/backports Translation-en_US
Err http://ftp.debian.org jessie-proposed-updates/main Sources
  404  Not Found [IP: 130.89.148.12 80]
Err http://ftp.debian.org jessie-proposed-updates/contrib arm64 Packages
  404  Not Found [IP: 130.89.148.12 80]
Get:55 http://oph.mdrjr.net jessie/backports Translation-en [331 B]
Ign http://oph.mdrjr.net jessie/backports Translation-en
Err http://ftp.debian.org jessie-proposed-updates/non-free arm64 Packages
  404  Not Found [IP: 130.89.148.12 80]
Err http://ftp.debian.org jessie-proposed-updates/main arm64 Packages
  404  Not Found [IP: 130.89.148.12 80]
Get:56 http://oph.mdrjr.net jessie/main Translation-en_US [329 B]
Ign http://oph.mdrjr.net jessie/main Translation-en_US
Get:57 http://oph.mdrjr.net jessie/main Translation-en [326 B]
Ign http://oph.mdrjr.net jessie/main Translation-en
W: Failed to fetch http://ftp.debian.org/debian/dists/jessie-updates/InRelease  Unable to find expected entry 'main/source/Sources' in Release file (Wrong sources.list entry or malformed file)

W: Failed to fetch http://security.debian.org/dists/jessie/updates/InRelease  Unable to find expected entry 'main/binary-arm64/Packages' in Release file (Wrong sources.list entry or malformed file)

W: Failed to fetch https://raspbian.snips.ai/jessie/dists/stable/InRelease  Unable to find expected entry 'main/binary-arm64/Packages' in Release file (Wrong sources.list entry or malformed file)

W: Failed to fetch http://ftp.debian.org/debian/dists/jessie/main/binary-arm64/Packages  404  Not Found [IP: 130.89.148.12 80]

W: Failed to fetch http://ftp.debian.org/debian/dists/jessie/contrib/binary-arm64/Packages  404  Not Found [IP: 130.89.148.12 80]

W: Failed to fetch http://ftp.debian.org/debian/dists/jessie/non-free/binary-arm64/Packages  404  Not Found [IP: 130.89.148.12 80]

W: Failed to fetch http://ftp.debian.org/debian/dists/jessie-backports/main/source/Sources  404  Not Found [IP: 130.89.148.12 80]

W: Failed to fetch http://ftp.debian.org/debian/dists/jessie-backports/contrib/source/Sources  404  Not Found [IP: 130.89.148.12 80]

W: Failed to fetch http://ftp.debian.org/debian/dists/jessie-backports/non-free/source/Sources  404  Not Found [IP: 130.89.148.12 80]

W: Failed to fetch http://ftp.debian.org/debian/dists/jessie-backports/main/binary-arm64/Packages  404  Not Found [IP: 130.89.148.12 80]

W: Failed to fetch http://ftp.debian.org/debian/dists/jessie-backports/contrib/binary-arm64/Packages  404  Not Found [IP: 130.89.148.12 80]

W: Failed to fetch http://ftp.debian.org/debian/dists/jessie-backports/non-free/binary-arm64/Packages  404  Not Found [IP: 130.89.148.12 80]

W: Failed to fetch http://ftp.debian.org/debian/dists/jessie-proposed-updates/contrib/source/Sources  404  Not Found [IP: 130.89.148.12 80]

W: Failed to fetch http://ftp.debian.org/debian/dists/jessie-proposed-updates/non-free/source/Sources  404  Not Found [IP: 130.89.148.12 80]

W: Failed to fetch http://ftp.debian.org/debian/dists/jessie-proposed-updates/main/source/Sources  404  Not Found [IP: 130.89.148.12 80]

W: Failed to fetch http://ftp.debian.org/debian/dists/jessie-proposed-updates/contrib/binary-arm64/Packages  404  Not Found [IP: 130.89.148.12 80]

W: Failed to fetch http://ftp.debian.org/debian/dists/jessie-proposed-updates/non-free/binary-arm64/Packages  404  Not Found [IP: 130.89.148.12 80]

W: Failed to fetch http://ftp.debian.org/debian/dists/jessie-proposed-updates/main/binary-arm64/Packages  404  Not Found [IP: 130.89.148.12 80]

E: Some index files failed to download. They have been ignored, or old ones used instead.

-- Installation of python3 and dependancies
Reading package lists...
Building dependency tree...
Reading state information...
build-essential is already the newest version.
python-dev is already the newest version.
python3 is already the newest version.
0 upgraded, 0 newly installed, 0 to remove and 46 not upgraded.

-- Installed version of Python :
Python 3.4.2

-- Installation of pip for python3 and necessary libraries
Reading package lists...
Building dependency tree...
Reading state information...
python3-pip is already the newest version.
python-requests is already the newest version.
The following extra packages will be installed:
  libpython3-dev libpython3.4 libpython3.4-dev python3.4-dev
The following NEW packages will be installed:
  libpython3-dev libpython3.4 libpython3.4-dev python3-dev python3.4-dev
0 upgraded, 5 newly installed, 0 to remove and 46 not upgraded.
Need to get 3,489 kB of archives.
After this operation, 18.3 MB of additional disk space will be used.
Err http://ftp.debian.org/debian/ jessie/main libpython3.4 arm64 3.4.2-1
  404  Not Found [IP: 130.89.148.12 80]
Err http://ftp.debian.org/debian/ jessie/main libpython3.4-dev arm64 3.4.2-1
  404  Not Found [IP: 130.89.148.12 80]
Err http://ftp.debian.org/debian/ jessie/main libpython3-dev arm64 3.4.2-2
  404  Not Found [IP: 130.89.148.12 80]
Err http://ftp.debian.org/debian/ jessie/main python3.4-dev arm64 3.4.2-1
  404  Not Found [IP: 130.89.148.12 80]
Err http://ftp.debian.org/debian/ jessie/main python3-dev arm64 3.4.2-2
  404  Not Found [IP: 130.89.148.12 80]
E: Failed to fetch http://ftp.debian.org/debian/pool/main/p/python3.4/libpython3.4_3.4.2-1_arm64.deb  404  Not Found [IP: 130.89.148.12 80]

E: Failed to fetch http://ftp.debian.org/debian/pool/main/p/python3.4/libpython3.4-dev_3.4.2-1_arm64.deb  404  Not Found [IP: 130.89.148.12 80]

E: Failed to fetch http://ftp.debian.org/debian/pool/main/p/python3-defaults/libpython3-dev_3.4.2-2_arm64.deb  404  Not Found [IP: 130.89.148.12 80]

E: Failed to fetch http://ftp.debian.org/debian/pool/main/p/python3.4/python3.4-dev_3.4.2-1_arm64.deb  404  Not Found [IP: 130.89.148.12 80]

E: Failed to fetch http://ftp.debian.org/debian/pool/main/p/python3-defaults/python3-dev_3.4.2-2_arm64.deb  404  Not Found [IP: 130.89.148.12 80]

E: Unable to fetch some archives, maybe run apt-get update or try with --fix-missing?

-- Installation of TTS libraries
Reading package lists...
Building dependency tree...
Reading state information...
Some packages could not be installed. This may mean that you have
requested an impossible situation or if you are using the unstable
distribution that some required packages have not yet been created
or been moved out of Incoming.
The following information may help to resolve the situation:

The following packages have unmet dependencies:
 sox : Depends: libsox-fmt-base (= 14.4.1-5) but it is not going to be installed
E: Unable to correct problems, you have held broken packages.

-- Installation of libav/ffmpeg libraries
Reading package lists...
Building dependency tree...
Reading state information...
The following packages were automatically installed and are no longer required:
  libavcodec56 libavdevice55 libavfilter5 libavformat56 libavresample2
  libavutil54 libdirectfb-1.2-9 libopenjpeg5 liborc-0.4-0
  libschroedinger-1.0-0 libsdl1.2debian libswscale3
Use 'apt-get autoremove' to remove them.
The following extra packages will be installed:
  ffmpeg libass5 libavc1394-0 libavcodec-extra57 libavdevice57 libavfilter6
  libavformat57 libavresample3 libavutil55 libbluray1 libbs2b0 libchromaprint1
  libenca0 libfftw3-double3 libflite1 libfribidi0 libgme0 libgraphite2-3
  libharfbuzz0b libiec61883-0 libmodplug1 libnuma1 libopenal-data libopenal1
  libopencore-amrnb0 libopencore-amrwb0 libopenjp2-7 libpgm-5.1-0
  libpostproc54 librubberband2 libsdl2-2.0-0 libshine3 libsnappy1 libsodium13
  libsoxr0 libssh-gcrypt-4 libswresample2 libswscale4 libtwolame0 libva-drm1
  libva-x11-1 libvo-amrwbenc0 libwavpack1 libx265-87 libxcb-shape0 libxcb-shm0
  libxcb-xfixes0 libxcursor1 libxinerama1 libxrandr2 libxrender1 libxss1
  libxv1 libzmq3 libzvbi-common libzvbi0
Suggested packages:
  ffmpeg-doc libbluray-bdj libfftw3-bin libfftw3-dev alsa-base
Recommended packages:
  libaacs0
The following NEW packages will be installed:
  ffmpeg libass5 libavc1394-0 libavcodec-extra libavcodec-extra57
  libavdevice57 libavfilter6 libavformat57 libavresample3 libavutil55
  libbluray1 libbs2b0 libchromaprint1 libenca0 libfftw3-double3 libflite1
  libfribidi0 libgme0 libgraphite2-3 libharfbuzz0b libiec61883-0 libmodplug1
  libnuma1 libopenal-data libopenal1 libopencore-amrnb0 libopencore-amrwb0
  libopenjp2-7 libpgm-5.1-0 libpostproc54 librubberband2 libsdl2-2.0-0
  libshine3 libsnappy1 libsodium13 libsoxr0 libssh-gcrypt-4 libswresample2
  libswscale4 libtwolame0 libva-drm1 libva-x11-1 libvo-amrwbenc0 libwavpack1
  libx265-87 libxcb-shape0 libxcb-shm0 libxcb-xfixes0 libxcursor1 libxinerama1
  libxrandr2 libxrender1 libxss1 libxv1 libzmq3 libzvbi-common libzvbi0
The following packages will be upgraded:
  libav-tools
1 upgraded, 57 newly installed, 0 to remove and 45 not upgraded.
Need to get 25.1 MB of archives.
After this operation, 52.9 MB of additional disk space will be used.
WARNING: The following packages cannot be authenticated!
  libva-drm1 libva-x11-1 libavutil55 libswresample2 libx265-87
  libavcodec-extra57 libchromaprint1 libfftw3-double3 libav-tools libbluray1
  libavformat57 libavresample3 libpostproc54 libswscale4 libavfilter6
  libavdevice57 ffmpeg libavcodec-extra
E: There are problems and -y was used without --force-yes

-- Upgrade setuptools with command python3 -m pip if not up to date
Requirement already satisfied (use --upgrade to upgrade): setuptools in /usr/lib/python3/dist-packages
Cleaning up...

-- Installed version of pip :
pip 1.5.6 from /usr/lib/python3/dist-packages (python 3.4)

-- Installation of python library 'netifaces' with command python3 -m pip
Downloading/unpacking netifaces
  Downloading netifaces-0.10.9.tar.gz
  Running setup.py (path:/tmp/pip-build-jdsjvhbr/netifaces/setup.py) egg_info for package netifaces
    
Installing collected packages: netifaces
  Running setup.py install for netifaces
    checking for getifaddrs...found.
    checking for getnameinfo...found.
    checking for IPv6 socket IOCTLs...not found.
    checking for optional header files...netash/ash.h netatalk/at.h netax25/ax25.h neteconet/ec.h netipx/ipx.h netpacket/packet.h linux/irda.h linux/atm.h linux/llc.h linux/tipc.h linux/dn.h.
    checking whether struct sockaddr has a length field...no.
    checking which sockaddr_xxx structs are defined...at ax25 in in6 ipx un ash ec ll atmpvc atmsvc dn irda llc.
    checking for routing socket support...no.
    checking for sysctl(CTL_NET...) support...no.
    checking for netlink support...yes.
    will use netlink to read routing table
    building 'netifaces' extension
    aarch64-linux-gnu-gcc -pthread -DNDEBUG -g -fwrapv -O2 -Wall -Wstrict-prototypes -g -fstack-protector-strong -Wformat -Werror=format-security -D_FORTIFY_SOURCE=2 -fPIC -DNETIFACES_VERSION=0.10.9 -DHAVE_GETIFADDRS=1 -DHAVE_GETNAMEINFO=1 -DHAVE_NETASH_ASH_H=1 -DHAVE_NETATALK_AT_H=1 -DHAVE_NETAX25_AX25_H=1 -DHAVE_NETECONET_EC_H=1 -DHAVE_NETIPX_IPX_H=1 -DHAVE_NETPACKET_PACKET_H=1 -DHAVE_LINUX_IRDA_H=1 -DHAVE_LINUX_ATM_H=1 -DHAVE_LINUX_LLC_H=1 -DHAVE_LINUX_TIPC_H=1 -DHAVE_LINUX_DN_H=1 -DHAVE_SOCKADDR_AT=1 -DHAVE_SOCKADDR_AX25=1 -DHAVE_SOCKADDR_IN=1 -DHAVE_SOCKADDR_IN6=1 -DHAVE_SOCKADDR_IPX=1 -DHAVE_SOCKADDR_UN=1 -DHAVE_SOCKADDR_ASH=1 -DHAVE_SOCKADDR_EC=1 -DHAVE_SOCKADDR_LL=1 -DHAVE_SOCKADDR_ATMPVC=1 -DHAVE_SOCKADDR_ATMSVC=1 -DHAVE_SOCKADDR_DN=1 -DHAVE_SOCKADDR_IRDA=1 -DHAVE_SOCKADDR_LLC=1 -DHAVE_PF_NETLINK=1 -I/usr/include/python3.4m -c netifaces.c -o build/temp.linux-aarch64-3.4/netifaces.o
    netifaces.c:1:20: fatal error: Python.h: No such file or directory
     #include <Python.h>
                        ^
    compilation terminated.
    error: command 'aarch64-linux-gnu-gcc' failed with exit status 1
    Complete output from command /usr/bin/python3 -c "import setuptools, tokenize;__file__='/tmp/pip-build-jdsjvhbr/netifaces/setup.py';exec(compile(getattr(tokenize, 'open', open)(__file__).read().replace('
', '
'), __file__, 'exec'))" install --record /tmp/pip-awos53rh-record/install-record.txt --single-version-externally-managed --compile:
    running install

running build

running build_ext

checking for getifaddrs...found.

checking for getnameinfo...found.

checking for IPv6 socket IOCTLs...not found.

checking for optional header files...netash/ash.h netatalk/at.h netax25/ax25.h neteconet/ec.h netipx/ipx.h netpacket/packet.h linux/irda.h linux/atm.h linux/llc.h linux/tipc.h linux/dn.h.

checking whether struct sockaddr has a length field...no.

checking which sockaddr_xxx structs are defined...at ax25 in in6 ipx un ash ec ll atmpvc atmsvc dn irda llc.

checking for routing socket support...no.

checking for sysctl(CTL_NET...) support...no.

checking for netlink support...yes.

will use netlink to read routing table

building 'netifaces' extension

aarch64-linux-gnu-gcc -pthread -DNDEBUG -g -fwrapv -O2 -Wall -Wstrict-prototypes -g -fstack-protector-strong -Wformat -Werror=format-security -D_FORTIFY_SOURCE=2 -fPIC -DNETIFACES_VERSION=0.10.9 -DHAVE_GETIFADDRS=1 -DHAVE_GETNAMEINFO=1 -DHAVE_NETASH_ASH_H=1 -DHAVE_NETATALK_AT_H=1 -DHAVE_NETAX25_AX25_H=1 -DHAVE_NETECONET_EC_H=1 -DHAVE_NETIPX_IPX_H=1 -DHAVE_NETPACKET_PACKET_H=1 -DHAVE_LINUX_IRDA_H=1 -DHAVE_LINUX_ATM_H=1 -DHAVE_LINUX_LLC_H=1 -DHAVE_LINUX_TIPC_H=1 -DHAVE_LINUX_DN_H=1 -DHAVE_SOCKADDR_AT=1 -DHAVE_SOCKADDR_AX25=1 -DHAVE_SOCKADDR_IN=1 -DHAVE_SOCKADDR_IN6=1 -DHAVE_SOCKADDR_IPX=1 -DHAVE_SOCKADDR_UN=1 -DHAVE_SOCKADDR_ASH=1 -DHAVE_SOCKADDR_EC=1 -DHAVE_SOCKADDR_LL=1 -DHAVE_SOCKADDR_ATMPVC=1 -DHAVE_SOCKADDR_ATMSVC=1 -DHAVE_SOCKADDR_DN=1 -DHAVE_SOCKADDR_IRDA=1 -DHAVE_SOCKADDR_LLC=1 -DHAVE_PF_NETLINK=1 -I/usr/include/python3.4m -c netifaces.c -o build/temp.linux-aarch64-3.4/netifaces.o

netifaces.c:1:20: fatal error: Python.h: No such file or directory

 #include <Python.h>

                    ^

compilation terminated.

error: command 'aarch64-linux-gnu-gcc' failed with exit status 1

----------------------------------------
Cleaning up...
Command /usr/bin/python3 -c "import setuptools, tokenize;__file__='/tmp/pip-build-jdsjvhbr/netifaces/setup.py';exec(compile(getattr(tokenize, 'open', open)(__file__).read().replace('
', '
'), __file__, 'exec'))" install --record /tmp/pip-awos53rh-record/install-record.txt --single-version-externally-managed --compile failed with error code 1 in /tmp/pip-build-jdsjvhbr/netifaces
Storing debug log for failure in /root/.pip/pip.log

-- Installation of python library 'requests' with command python3 -m pip
Requirement already satisfied (use --upgrade to upgrade): requests in /usr/lib/python3/dist-packages
Cleaning up...

-- Installation of python library 'protobuf' with command python3 -m pip
Requirement already satisfied (use --upgrade to upgrade): protobuf in /usr/local/lib/python3.4/dist-packages
Cleaning up...

-- Installation of python library 'zeroconf' with command python3 -m pip
Requirement already satisfied (use --upgrade to upgrade): zeroconf in /usr/local/lib/python3.4/dist-packages
Cleaning up...

-- Installation of python library 'click, bs4 and six' for TTS with command python3 -m pip
Requirement already satisfied (use --upgrade to upgrade): click in /usr/local/lib/python3.4/dist-packages
Requirement already satisfied (use --upgrade to upgrade): bs4 in /usr/local/lib/python3.4/dist-packages
Requirement already satisfied (use --upgrade to upgrade): six in /usr/local/lib/python3.4/dist-packages
Requirement already satisfied (use --upgrade to upgrade): beautifulsoup4 in /usr/local/lib/python3.4/dist-packages (from bs4)
Cleaning up...

-- Installation of python library 'tqdm, websocket-client' for plex with command python3 -m pip
Requirement already satisfied (use --upgrade to upgrade): tqdm in /usr/local/lib/python3.4/dist-packages
Requirement already satisfied (use --upgrade to upgrade): websocket-client in /usr/local/lib/python3.4/dist-packages
Cleaning up...

-- Installation of dependencies is done !
Merci pour votre aide

Heracles44
Actif
Messages : 518
Inscription : 23 juil. 2018, 13:06

Re: [Plugin Tiers][Sujet Principal] Google Cast

Message par Heracles44 » 02 juin 2019, 17:52

Serait-ce possible de mettre l’icone Pour le JBL Link 10/20 et le Google Home Hub?

raphael_malin
Timide
Messages : 481
Inscription : 10 nov. 2014, 00:20
Localisation : Nouméa - Nouvelle-Calédonie

Re: [Plugin Tiers][Sujet Principal] Google Cast

Message par raphael_malin » 04 juin 2019, 08:20

Hello,
Comment faire pour que lorsque j'active une radio par l'interface jeedom, lorsque je dis ok google STOP, cela éjecte le média?
Sinon ça reste en mémoire, et lorsqu'il y'a un TTS qui passe, la radio reprend après.
Merci
Jeedom smart avec en général toutes les mises à jour faites (système et plugin)

Heracles44
Actif
Messages : 518
Inscription : 23 juil. 2018, 13:06

Re: [Plugin Tiers][Sujet Principal] Google Cast

Message par Heracles44 » 04 juin 2019, 12:36

Bonjour,
Jusqu'à hier je pouvais cast un Design sur Google Home Hub.
Ce matin ca ne marche plus.
Un ami ayant un contact Google confirme que Google n'a rien fait!
Pouvez vous rectifier le tir pour régler ce bug et ainsi pouvoir remettre des Design sur Google Home Hub?
Merci

Avatar de l’utilisateur
noodom
Actif
Messages : 980
Inscription : 13 juil. 2014, 17:25
Contact :

Re: [Plugin Tiers][Sujet Principal] Google Cast

Message par noodom » 04 juin 2019, 12:48

Salut,

Je pense qu'il faudrait que tu précises ce que tu as modifié entre hier et aujourd'hui sur ton Jeedom pour avoir une piste sur d'éventuelles corrections à faire ?

Heracles44
Actif
Messages : 518
Inscription : 23 juil. 2018, 13:06

Re: [Plugin Tiers][Sujet Principal] Google Cast

Message par Heracles44 » 04 juin 2019, 13:33

Après un redémarrage de mon Pi3, ca remarche... bizarre

Avatar de l’utilisateur
Donut
Timide
Messages : 182
Inscription : 07 févr. 2017, 09:53
Localisation : Charente-Maritime

Re: [Plugin Tiers][Sujet Principal] Google Cast

Message par Donut » 05 juin 2019, 13:26

Bonjour,
Je viens d'installer le plugin, et j'ai le même problème que certain, ACTIF en vert mais NOK en rouge et CONFIGURATION en rouge.
J'ai les dépendances qui se lancent toutes les 5 minutes environ mais rien au bout.
Je clique sur "Lancer scan" cela dur 3sec et ne trouve rien, j'ai pourtant 1 ChromeCast et 2 Google Home mini.

Log Googlecast :
[2019-06-05 13:06:53][DEBUG] : Lancement de : /var/www/html/core/class/../../core/php/jeePlugin.php plugin_id=googlecast function=remove callInstallFunction=1
[2019-06-05 13:06:57][INFO] : Début d'activation du plugin
[2019-06-05 13:06:58][INFO] : Info sur le démon : Array ( [launchable_message] => [launchable] => nok [state] => nok [log] => nok [auto] => 0 )
[2019-06-05 13:06:58][DEBUG] : Lancement de : /var/www/html/core/class/../../core/php/jeePlugin.php plugin_id=googlecast function=install callInstallFunction=1
Log Googlecast_update :
Launch install of googlecast dependancies
-- Updating repo...
Hit http://repo.jeedom.com stable InRelease
Ign http://ftp.debian.org jessie InRelease
Hit /http://archive.debian.org jessie-backports InRelease
Hit http://ftp.debian.org jessie Release.gpg
Hit http://ftp.debian.org jessie Release
Ign /http://archive.debian.org jessie-backports/main Sources/DiffIndex
Hit http://security.debian.org jessie/updates InRelease
Hit http://repo.jeedom.com stable/main arm64 Packages
Ign /http://archive.debian.org jessie-backports/contrib Sources/DiffIndex
Ign /http://archive.debian.org jessie-backports/non-free Sources/DiffIndex
Ign /http://archive.debian.org jessie-backports/main arm64 Packages/DiffIndex
Get:1 http://security.debian.org jessie/updates/main Sources [318 kB]
Ign /http://archive.debian.org jessie-backports/contrib arm64 Packages/DiffIndex
Ign /http://archive.debian.org jessie-backports/non-free arm64 Packages/DiffIndex
Ign /http://archive.debian.org jessie-backports/contrib Translation-en/DiffIndex
Ign /http://archive.debian.org jessie-backports/main Translation-en/DiffIndex
Ign /http://archive.debian.org jessie-backports/non-free Translation-en/DiffIndex
Hit http://ftp.debian.org jessie/main Sources
Get:2 http://security.debian.org jessie/updates/non-free Sources [1,626 B]
Hit http://ftp.debian.org jessie/contrib Sources
Hit http://security.debian.org jessie/updates/contrib Sources
Ign http://repo.jeedom.com stable/main Translation-en_US
Hit http://ftp.debian.org jessie/non-free Sources
Ign http://repo.jeedom.com stable/main Translation-en
Hit http://ftp.debian.org jessie/contrib Translation-en
Hit http://ftp.debian.org jessie/main Translation-en
Hit http://ftp.debian.org jessie/non-free Translation-en
Err http://ftp.debian.org jessie/main arm64 Packages
404 Not Found [IP: 130.89.148.12 80]
Err http://ftp.debian.org jessie/contrib arm64 Packages
404 Not Found [IP: 130.89.148.12 80]
Err http://ftp.debian.org jessie/non-free arm64 Packages
404 Not Found [IP: 130.89.148.12 80]
Hit http://oph.mdrjr.net all InRelease
Hit http://oph.mdrjr.net jessie InRelease
Hit /http://archive.debian.org jessie-backports/contrib Translation-en
Hit /http://archive.debian.org jessie-backports/main Translation-en
Get:3 http://oph.mdrjr.net all/c2 arm64 Packages
Hit /http://archive.debian.org jessie-backports/non-free Translation-en
Hit http://oph.mdrjr.net all/c2 arm64 Packages
Hit /http://archive.debian.org jessie-backports/main Sources
Hit /http://archive.debian.org jessie-backports/contrib Sources
Get:4 http://oph.mdrjr.net all/main arm64 Packages
Hit /http://archive.debian.org jessie-backports/non-free Sources
Hit /http://archive.debian.org jessie-backports/main arm64 Packages
Get:5 http://oph.mdrjr.net all/testing arm64 Packages
Hit /http://archive.debian.org jessie-backports/contrib arm64 Packages
Hit /http://archive.debian.org jessie-backports/non-free arm64 Packages
Hit http://oph.mdrjr.net all/main arm64 Packages
Get:6 http://oph.mdrjr.net all/c2 Translation-en_US [324 B]
Hit http://oph.mdrjr.net all/testing arm64 Packages
Get:7 http://oph.mdrjr.net all/c2 Translation-en [321 B]
Get:8 http://oph.mdrjr.net all/main Translation-en_US [326 B]
Get:9 http://oph.mdrjr.net all/main Translation-en [323 B]
Get:10 http://oph.mdrjr.net all/testing Translation-en_US [329 B]
Get:11 http://oph.mdrjr.net all/testing Translation-en [326 B]
Get:12 http://oph.mdrjr.net jessie/backports arm64 Packages
Get:13 http://oph.mdrjr.net jessie/main arm64 Packages
Get:14 http://oph.mdrjr.net jessie/backports Translation-en_US [334 B]
Get:15 http://oph.mdrjr.net jessie/backports Translation-en [331 B]
Hit http://oph.mdrjr.net jessie/backports arm64 Packages
Get:16 http://oph.mdrjr.net jessie/main Translation-en_US [329 B]
Hit http://oph.mdrjr.net jessie/main arm64 Packages
Get:17 http://oph.mdrjr.net jessie/main Translation-en [326 B]
Get:18 http://oph.mdrjr.net all/c2 Translation-en_US [324 B]
Get:19 http://oph.mdrjr.net all/c2 Translation-en [321 B]
Get:20 http://oph.mdrjr.net all/main Translation-en_US [326 B]
Get:21 http://oph.mdrjr.net all/main Translation-en [323 B]
Get:22 http://oph.mdrjr.net all/testing Translation-en_US [329 B]
Get:23 http://oph.mdrjr.net all/testing Translation-en [326 B]
Get:24 http://oph.mdrjr.net jessie/backports Translation-en_US [334 B]
Get:25 http://oph.mdrjr.net jessie/backports Translation-en [331 B]
Get:26 http://oph.mdrjr.net jessie/main Translation-en_US [329 B]
Get:27 http://oph.mdrjr.net jessie/main Translation-en [326 B]
Get:28 http://oph.mdrjr.net all/c2 Translation-en_US [324 B]
Get:29 http://oph.mdrjr.net all/c2 Translation-en [321 B]
Get:30 http://oph.mdrjr.net all/main Translation-en_US [326 B]
Get:31 http://oph.mdrjr.net all/main Translation-en [323 B]
Get:32 http://oph.mdrjr.net all/testing Translation-en_US [329 B]
Get:33 http://oph.mdrjr.net all/testing Translation-en [326 B]
Get:34 http://oph.mdrjr.net jessie/backports Translation-en_US [334 B]
Get:35 http://oph.mdrjr.net jessie/backports Translation-en [331 B]
Get:36 http://oph.mdrjr.net jessie/main Translation-en_US [329 B]
Get:37 http://oph.mdrjr.net jessie/main Translation-en [326 B]
Get:38 http://oph.mdrjr.net all/c2 Translation-en_US [324 B]
Get:39 http://oph.mdrjr.net all/c2 Translation-en [321 B]
Get:40 http://oph.mdrjr.net all/main Translation-en_US [326 B]
Get:41 http://oph.mdrjr.net all/main Translation-en [323 B]
Get:42 http://oph.mdrjr.net all/testing Translation-en_US [329 B]
Get:43 http://oph.mdrjr.net all/testing Translation-en [326 B]
Get:44 http://oph.mdrjr.net jessie/backports Translation-en_US [334 B]
Get:45 http://oph.mdrjr.net jessie/backports Translation-en [331 B]
Get:46 http://oph.mdrjr.net jessie/main Translation-en_US [329 B]
Get:47 http://oph.mdrjr.net jessie/main Translation-en [326 B]
Get:48 http://oph.mdrjr.net all/c2 Translation-en_US [324 B]
Ign http://oph.mdrjr.net all/c2 Translation-en_US
Get:49 http://oph.mdrjr.net all/c2 Translation-en [321 B]
Ign http://oph.mdrjr.net all/c2 Translation-en
Get:50 http://oph.mdrjr.net all/main Translation-en_US [326 B]
Ign http://oph.mdrjr.net all/main Translation-en_US
Get:51 http://oph.mdrjr.net all/main Translation-en [323 B]
Ign http://oph.mdrjr.net all/main Translation-en
Get:52 http://oph.mdrjr.net all/testing Translation-en_US [329 B]
Ign http://oph.mdrjr.net all/testing Translation-en_US
Get:53 http://oph.mdrjr.net all/testing Translation-en [326 B]
Ign http://oph.mdrjr.net all/testing Translation-en
Get:54 http://oph.mdrjr.net jessie/backports Translation-en_US [334 B]
Ign http://oph.mdrjr.net jessie/backports Translation-en_US
Get:55 http://oph.mdrjr.net jessie/backports Translation-en [331 B]
Ign http://oph.mdrjr.net jessie/backports Translation-en
Get:56 http://oph.mdrjr.net jessie/main Translation-en_US [329 B]
Ign http://oph.mdrjr.net jessie/main Translation-en_US
Get:57 http://oph.mdrjr.net jessie/main Translation-en [326 B]
Ign http://oph.mdrjr.net jessie/main Translation-en
W: Failed to fetch http://security.debian.org/dists/jessie ... /InRelease Unable to find expected entry 'main/binary-arm64/Packages' in Release file (Wrong sources.list entry or malformed file)
W: Failed to fetch http://ftp.debian.org/debian/dists/jess ... 4/Packages 404 Not Found [IP: 130.89.148.12 80]
W: Failed to fetch http://ftp.debian.org/debian/dists/jess ... 4/Packages 404 Not Found [IP: 130.89.148.12 80]
W: Failed to fetch http://ftp.debian.org/debian/dists/jess ... 4/Packages 404 Not Found [IP: 130.89.148.12 80]
E: Some index files failed to download. They have been ignored, or old ones used instead.
-- Installation of python3 and dependancies
Reading package lists...
Building dependency tree...
Reading state information...
build-essential is already the newest version.
python-dev is already the newest version.
python3 is already the newest version.
The following package was automatically installed and is no longer required:
linux-headers-3.14.29+
Use 'apt-get autoremove' to remove it.
0 upgraded, 0 newly installed, 0 to remove and 2 not upgraded.
-- Installed version of Python :
Python 3.4.2
-- Installation of pip for python3 and necessary libraries
Reading package lists...
Building dependency tree...
Reading state information...
python3-pip is already the newest version.
python-requests is already the newest version.
The following package was automatically installed and is no longer required:
linux-headers-3.14.29+
Use 'apt-get autoremove' to remove it.
The following extra packages will be installed:
libpython3-dev libpython3.4 libpython3.4-dev python3.4-dev
The following NEW packages will be installed:
libpython3-dev libpython3.4 libpython3.4-dev python3-dev python3.4-dev
0 upgraded, 5 newly installed, 0 to remove and 2 not upgraded.
Need to get 3,489 kB of archives.
After this operation, 18.3 MB of additional disk space will be used.
Err http://ftp.debian.org/debian/ jessie/main libpython3.4 arm64 3.4.2-1
404 Not Found [IP: 130.89.148.12 80]
Err http://ftp.debian.org/debian/ jessie/main libpython3.4-dev arm64 3.4.2-1
404 Not Found [IP: 130.89.148.12 80]
Err http://ftp.debian.org/debian/ jessie/main libpython3-dev arm64 3.4.2-2
404 Not Found [IP: 130.89.148.12 80]
Err http://ftp.debian.org/debian/ jessie/main python3.4-dev arm64 3.4.2-1
404 Not Found [IP: 130.89.148.12 80]
Err http://ftp.debian.org/debian/ jessie/main python3-dev arm64 3.4.2-2
404 Not Found [IP: 130.89.148.12 80]
E: Failed to fetch http://ftp.debian.org/debian/pool/main/ ... _arm64.deb 404 Not Found [IP: 130.89.148.12 80]
E: Failed to fetch http://ftp.debian.org/debian/pool/main/ ... _arm64.deb 404 Not Found [IP: 130.89.148.12 80]
E: Failed to fetch http://ftp.debian.org/debian/pool/main/ ... _arm64.deb 404 Not Found [IP: 130.89.148.12 80]
E: Failed to fetch http://ftp.debian.org/debian/pool/main/ ... _arm64.deb 404 Not Found [IP: 130.89.148.12 80]
E: Failed to fetch http://ftp.debian.org/debian/pool/main/ ... _arm64.deb 404 Not Found [IP: 130.89.148.12 80]
E: Unable to fetch some archives, maybe run apt-get update or try with --fix-missing?
-- Installation of TTS libraries
Reading package lists...
Building dependency tree...
Reading state information...
The following package was automatically installed and is no longer required:
linux-headers-3.14.29+
Use 'apt-get autoremove' to remove it.
The following extra packages will be installed:
libltdl7 libopencore-amrnb0 libopencore-amrwb0 libsox-fmt-alsa
libsox-fmt-base libsox2 libttspico-data libttspico0 libvorbisfile3
libwavpack1
Suggested packages:
libsox-fmt-all
The following NEW packages will be installed:
libltdl7 libopencore-amrnb0 libopencore-amrwb0 libsox-fmt-alsa
libsox-fmt-base libsox2 libttspico-data libttspico-utils libttspico0
libvorbisfile3 libwavpack1 sox
0 upgraded, 12 newly installed, 0 to remove and 2 not upgraded.
Need to get 864 kB/5,012 kB of archives.
After this operation, 8,646 kB of additional disk space will be used.
Err http://ftp.debian.org/debian/ jessie/main libltdl7 arm64 2.4.2-1.11
404 Not Found [IP: 130.89.148.12 80]
Err http://ftp.debian.org/debian/ jessie/main libopencore-amrnb0 arm64 0.1.3-2.1
404 Not Found [IP: 130.89.148.12 80]
Err http://ftp.debian.org/debian/ jessie/main libopencore-amrwb0 arm64 0.1.3-2.1
404 Not Found [IP: 130.89.148.12 80]
Err http://ftp.debian.org/debian/ jessie/main libsox2 arm64 14.4.1-5
404 Not Found [IP: 130.89.148.12 80]
Err http://ftp.debian.org/debian/ jessie/main libvorbisfile3 arm64 1.3.4-2+deb8u1
404 Not Found [IP: 130.89.148.12 80]
Err http://ftp.debian.org/debian/ jessie/main libwavpack1 arm64 4.70.0-1
404 Not Found [IP: 130.89.148.12 80]
Err http://ftp.debian.org/debian/ jessie/non-free libttspico0 arm64 1.0+git20130326-3
404 Not Found [IP: 130.89.148.12 80]
Err http://ftp.debian.org/debian/ jessie/main libsox-fmt-alsa arm64 14.4.1-5
404 Not Found [IP: 130.89.148.12 80]
Err http://ftp.debian.org/debian/ jessie/main libsox-fmt-base arm64 14.4.1-5
404 Not Found [IP: 130.89.148.12 80]
Err http://ftp.debian.org/debian/ jessie/main sox arm64 14.4.1-5
404 Not Found [IP: 130.89.148.12 80]
Err http://security.debian.org/ jessie/updates/main libvorbisfile3 arm64 1.3.4-2+deb8u1
404 Not Found [IP: 151.101.120.204 80]
Err http://ftp.debian.org/debian/ jessie/non-free libttspico-utils arm64 1.0+git20130326-3
404 Not Found [IP: 130.89.148.12 80]
E: Failed to fetch http://ftp.debian.org/debian/pool/main/ ... _arm64.deb 404 Not Found [IP: 130.89.148.12 80]
E: Failed to fetch http://ftp.debian.org/debian/pool/main/ ... _arm64.deb 404 Not Found [IP: 130.89.148.12 80]
E: Failed to fetch http://ftp.debian.org/debian/pool/main/ ... _arm64.deb 404 Not Found [IP: 130.89.148.12 80]
E: Failed to fetch http://ftp.debian.org/debian/pool/main/ ... _arm64.deb 404 Not Found [IP: 130.89.148.12 80]
E: Failed to fetch http://security.debian.org/pool/updates ... _arm64.deb 404 Not Found [IP: 151.101.120.204 80]
E: Failed to fetch http://ftp.debian.org/debian/pool/main/ ... _arm64.deb 404 Not Found [IP: 130.89.148.12 80]
E: Failed to fetch http://ftp.debian.org/debian/pool/non-f ... _arm64.deb 404 Not Found [IP: 130.89.148.12 80]
E: Failed to fetch http://ftp.debian.org/debian/pool/main/ ... _arm64.deb 404 Not Found [IP: 130.89.148.12 80]
E: Failed to fetch http://ftp.debian.org/debian/pool/main/ ... _arm64.deb 404 Not Found [IP: 130.89.148.12 80]
E: Failed to fetch http://ftp.debian.org/debian/pool/main/ ... _arm64.deb 404 Not Found [IP: 130.89.148.12 80]
E: Failed to fetch http://ftp.debian.org/debian/pool/non-f ... _arm64.deb 404 Not Found [IP: 130.89.148.12 80]
E: Unable to fetch some archives, maybe run apt-get update or try with --fix-missing?
-- Installation of libav/ffmpeg libraries
Reading package lists...
Building dependency tree...
Reading state information...
libav-tools is already the newest version.
The following package was automatically installed and is no longer required:
linux-headers-3.14.29+
Use 'apt-get autoremove' to remove it.
The following extra packages will be installed:
libavcodec-extra-56 libopencore-amrnb0 libopencore-amrwb0 libvo-aacenc0
libvo-amrwbenc0
The following packages will be REMOVED:
libavcodec56
The following NEW packages will be installed:
libavcodec-extra libavcodec-extra-56 libopencore-amrnb0 libopencore-amrwb0
libvo-aacenc0 libvo-amrwbenc0
0 upgraded, 6 newly installed, 1 to remove and 2 not upgraded.
Need to get 3,009 kB/3,187 kB of archives.
After this operation, 658 kB of additional disk space will be used.
Err http://ftp.debian.org/debian/ jessie/main libopencore-amrnb0 arm64 0.1.3-2.1
404 Not Found [IP: 130.89.148.12 80]
Err http://ftp.debian.org/debian/ jessie/main libopencore-amrwb0 arm64 0.1.3-2.1
404 Not Found [IP: 130.89.148.12 80]
Err http://ftp.debian.org/debian/ jessie/main libavcodec-extra-56 arm64 6:11.12-1~deb8u1
404 Not Found [IP: 130.89.148.12 80]
Err http://security.debian.org/ jessie/updates/main libavcodec-extra-56 arm64 6:11.12-1~deb8u1
404 Not Found [IP: 151.101.120.204 80]
E: Failed to fetch http://ftp.debian.org/debian/pool/main/ ... _arm64.deb 404 Not Found [IP: 130.89.148.12 80]
E: Failed to fetch http://ftp.debian.org/debian/pool/main/ ... _arm64.deb 404 Not Found [IP: 130.89.148.12 80]
E: Failed to fetch http://security.debian.org/pool/updates ... _arm64.deb 404 Not Found [IP: 151.101.120.204 80]
E: Unable to fetch some archives, maybe run apt-get update or try with --fix-missing?
-- Upgrade setuptools with command pip3 if not up to date
Requirement already satisfied (use --upgrade to upgrade): setuptools in /usr/lib/python3/dist-packages
Cleaning up...
-- Installed version of pip :
pip 1.5.6 from /usr/lib/python3/dist-packages (python 3.4)
-- Installation of python library 'netifaces' with command pip3
Downloading/unpacking netifaces
Downloading netifaces-0.10.9.tar.gz
Running setup.py (path:/tmp/pip-build-0tkhow3a/netifaces/setup.py) egg_info for package netifaces
Installing collected packages: netifaces
Running setup.py install for netifaces
checking for getifaddrs...found.
checking for getnameinfo...found.
checking for IPv6 socket IOCTLs...not found.
checking for optional header files...netash/ash.h netatalk/at.h netax25/ax25.h neteconet/ec.h netipx/ipx.h netpacket/packet.h linux/irda.h linux/atm.h linux/llc.h linux/tipc.h linux/dn.h.
checking whether struct sockaddr has a length field...no.
checking which sockaddr_xxx structs are defined...at ax25 in in6 ipx un ash ec ll atmpvc atmsvc dn irda llc.
checking for routing socket support...no.
checking for sysctl(CTL_NET...) support...no.
checking for netlink support...yes.
will use netlink to read routing table
building 'netifaces' extension
aarch64-linux-gnu-gcc -pthread -DNDEBUG -g -fwrapv -O2 -Wall -Wstrict-prototypes -g -fstack-protector-strong -Wformat -Werror=format-security -D_FORTIFY_SOURCE=2 -fPIC -DNETIFACES_VERSION=0.10.9 -DHAVE_GETIFADDRS=1 -DHAVE_GETNAMEINFO=1 -DHAVE_NETASH_ASH_H=1 -DHAVE_NETATALK_AT_H=1 -DHAVE_NETAX25_AX25_H=1 -DHAVE_NETECONET_EC_H=1 -DHAVE_NETIPX_IPX_H=1 -DHAVE_NETPACKET_PACKET_H=1 -DHAVE_LINUX_IRDA_H=1 -DHAVE_LINUX_ATM_H=1 -DHAVE_LINUX_LLC_H=1 -DHAVE_LINUX_TIPC_H=1 -DHAVE_LINUX_DN_H=1 -DHAVE_SOCKADDR_AT=1 -DHAVE_SOCKADDR_AX25=1 -DHAVE_SOCKADDR_IN=1 -DHAVE_SOCKADDR_IN6=1 -DHAVE_SOCKADDR_IPX=1 -DHAVE_SOCKADDR_UN=1 -DHAVE_SOCKADDR_ASH=1 -DHAVE_SOCKADDR_EC=1 -DHAVE_SOCKADDR_LL=1 -DHAVE_SOCKADDR_ATMPVC=1 -DHAVE_SOCKADDR_ATMSVC=1 -DHAVE_SOCKADDR_DN=1 -DHAVE_SOCKADDR_IRDA=1 -DHAVE_SOCKADDR_LLC=1 -DHAVE_PF_NETLINK=1 -I/usr/include/python3.4m -c netifaces.c -o build/temp.linux-aarch64-3.4/netifaces.o
netifaces.c:1:20: fatal error: Python.h: No such file or directory
#include <Python.h>
^
compilation terminated.
error: command 'aarch64-linux-gnu-gcc' failed with exit status 1
Complete output from command /usr/bin/python3 -c "import setuptools, tokenize;__file__='/tmp/pip-build-0tkhow3a/netifaces/setup.py';exec(compile(getattr(tokenize, 'open', open)(__file__).read().replace('
', '
'), __file__, 'exec'))" install --record /tmp/pip-c60d1ejd-record/install-record.txt --single-version-externally-managed --compile:
running install
running build
running build_ext
checking for getifaddrs...found.
checking for getnameinfo...found.
checking for IPv6 socket IOCTLs...not found.
checking for optional header files...netash/ash.h netatalk/at.h netax25/ax25.h neteconet/ec.h netipx/ipx.h netpacket/packet.h linux/irda.h linux/atm.h linux/llc.h linux/tipc.h linux/dn.h.
checking whether struct sockaddr has a length field...no.
checking which sockaddr_xxx structs are defined...at ax25 in in6 ipx un ash ec ll atmpvc atmsvc dn irda llc.
checking for routing socket support...no.
checking for sysctl(CTL_NET...) support...no.
checking for netlink support...yes.
will use netlink to read routing table
building 'netifaces' extension
aarch64-linux-gnu-gcc -pthread -DNDEBUG -g -fwrapv -O2 -Wall -Wstrict-prototypes -g -fstack-protector-strong -Wformat -Werror=format-security -D_FORTIFY_SOURCE=2 -fPIC -DNETIFACES_VERSION=0.10.9 -DHAVE_GETIFADDRS=1 -DHAVE_GETNAMEINFO=1 -DHAVE_NETASH_ASH_H=1 -DHAVE_NETATALK_AT_H=1 -DHAVE_NETAX25_AX25_H=1 -DHAVE_NETECONET_EC_H=1 -DHAVE_NETIPX_IPX_H=1 -DHAVE_NETPACKET_PACKET_H=1 -DHAVE_LINUX_IRDA_H=1 -DHAVE_LINUX_ATM_H=1 -DHAVE_LINUX_LLC_H=1 -DHAVE_LINUX_TIPC_H=1 -DHAVE_LINUX_DN_H=1 -DHAVE_SOCKADDR_AT=1 -DHAVE_SOCKADDR_AX25=1 -DHAVE_SOCKADDR_IN=1 -DHAVE_SOCKADDR_IN6=1 -DHAVE_SOCKADDR_IPX=1 -DHAVE_SOCKADDR_UN=1 -DHAVE_SOCKADDR_ASH=1 -DHAVE_SOCKADDR_EC=1 -DHAVE_SOCKADDR_LL=1 -DHAVE_SOCKADDR_ATMPVC=1 -DHAVE_SOCKADDR_ATMSVC=1 -DHAVE_SOCKADDR_DN=1 -DHAVE_SOCKADDR_IRDA=1 -DHAVE_SOCKADDR_LLC=1 -DHAVE_PF_NETLINK=1 -I/usr/include/python3.4m -c netifaces.c -o build/temp.linux-aarch64-3.4/netifaces.o
netifaces.c:1:20: fatal error: Python.h: No such file or directory
#include <Python.h>
^
compilation terminated.
error: command 'aarch64-linux-gnu-gcc' failed with exit status 1
----------------------------------------
Cleaning up...
Command /usr/bin/python3 -c "import setuptools, tokenize;__file__='/tmp/pip-build-0tkhow3a/netifaces/setup.py';exec(compile(getattr(tokenize, 'open', open)(__file__).read().replace('
', '
'), __file__, 'exec'))" install --record /tmp/pip-c60d1ejd-record/install-record.txt --single-version-externally-managed --compile failed with error code 1 in /tmp/pip-build-0tkhow3a/netifaces
Storing debug log for failure in /root/.pip/pip.log
-- Installation of python library 'requests' with command pip3
Requirement already satisfied (use --upgrade to upgrade): requests in /usr/lib/python3/dist-packages
Cleaning up...
-- Installation of python library 'protobuf' with command pip3
Requirement already satisfied (use --upgrade to upgrade): protobuf in /usr/local/lib/python3.4/dist-packages
Cleaning up...
-- Installation of python library 'zeroconf' with command pip3
Requirement already satisfied (use --upgrade to upgrade): zeroconf in /usr/local/lib/python3.4/dist-packages
Cleaning up...
-- Installation of python library 'click, bs4 and six' for TTS with command pip3
Requirement already satisfied (use --upgrade to upgrade): click in /usr/local/lib/python3.4/dist-packages
Requirement already satisfied (use --upgrade to upgrade): bs4 in /usr/local/lib/python3.4/dist-packages
Requirement already satisfied (use --upgrade to upgrade): six in /usr/local/lib/python3.4/dist-packages
Requirement already satisfied (use --upgrade to upgrade): beautifulsoup4 in /usr/local/lib/python3.4/dist-packages (from bs4)
Cleaning up...
-- Installation of python library 'tqdm, websocket-client' for plex with command pip3
Requirement already satisfied (use --upgrade to upgrade): tqdm in /usr/local/lib/python3.4/dist-packages
Requirement already satisfied (use --upgrade to upgrade): websocket-client in /usr/local/lib/python3.4/dist-packages
Cleaning up...
-- Installation of dependencies is done !
1 idée? je vois que des paquets d'IP ne fonctionne pas :/
Ps. J'ai redémarré ma box Jeedom toujours pareil.

Avatar de l’utilisateur
Poumi
Actif
Messages : 660
Inscription : 21 mars 2019, 22:41

Re: [Plugin Tiers][Sujet Principal] Google Cast

Message par Poumi » 05 juin 2019, 20:03

Le log d’update dit qu’il ne trouve pas des packages.

Tu es sous Jessie et certain packages ne sont plus dispo sous Jessie...

Solution: migrer sur stretch?

sim2000
Timide
Messages : 65
Inscription : 08 avr. 2018, 23:19

Re: [Plugin Tiers][Sujet Principal] Google Cast

Message par sim2000 » 05 juin 2019, 20:29

Donut a écrit :
05 juin 2019, 13:26
Bonjour,
Je viens d'installer le plugin, et j'ai le même problème que certain, ACTIF en vert mais NOK en rouge et CONFIGURATION en rouge.
J'ai les dépendances qui se lancent toutes les 5 minutes environ mais rien au bout.
Je clique sur "Lancer scan" cela dur 3sec et ne trouve rien, j'ai pourtant 1 ChromeCast et 2 Google Home mini.

Log Googlecast :
[2019-06-05 13:06:53][DEBUG] : Lancement de : /var/www/html/core/class/../../core/php/jeePlugin.php plugin_id=googlecast function=remove callInstallFunction=1
[2019-06-05 13:06:57][INFO] : Début d'activation du plugin
[2019-06-05 13:06:58][INFO] : Info sur le démon : Array ( [launchable_message] => [launchable] => nok [state] => nok [log] => nok [auto] => 0 )
[2019-06-05 13:06:58][DEBUG] : Lancement de : /var/www/html/core/class/../../core/php/jeePlugin.php plugin_id=googlecast function=install callInstallFunction=1
Log Googlecast_update :
Launch install of googlecast dependancies
-- Updating repo...
Hit http://repo.jeedom.com stable InRelease
Ign http://ftp.debian.org jessie InRelease
Hit /http://archive.debian.org jessie-backports InRelease
Hit http://ftp.debian.org jessie Release.gpg
Hit http://ftp.debian.org jessie Release
Ign /http://archive.debian.org jessie-backports/main Sources/DiffIndex
Hit http://security.debian.org jessie/updates InRelease
Hit http://repo.jeedom.com stable/main arm64 Packages
Ign /http://archive.debian.org jessie-backports/contrib Sources/DiffIndex
Ign /http://archive.debian.org jessie-backports/non-free Sources/DiffIndex
Ign /http://archive.debian.org jessie-backports/main arm64 Packages/DiffIndex
Get:1 http://security.debian.org jessie/updates/main Sources [318 kB]
Ign /http://archive.debian.org jessie-backports/contrib arm64 Packages/DiffIndex
Ign /http://archive.debian.org jessie-backports/non-free arm64 Packages/DiffIndex
Ign /http://archive.debian.org jessie-backports/contrib Translation-en/DiffIndex
Ign /http://archive.debian.org jessie-backports/main Translation-en/DiffIndex
Ign /http://archive.debian.org jessie-backports/non-free Translation-en/DiffIndex
Hit http://ftp.debian.org jessie/main Sources
Get:2 http://security.debian.org jessie/updates/non-free Sources [1,626 B]
Hit http://ftp.debian.org jessie/contrib Sources
Hit http://security.debian.org jessie/updates/contrib Sources
Ign http://repo.jeedom.com stable/main Translation-en_US
Hit http://ftp.debian.org jessie/non-free Sources
Ign http://repo.jeedom.com stable/main Translation-en
Hit http://ftp.debian.org jessie/contrib Translation-en
Hit http://ftp.debian.org jessie/main Translation-en
Hit http://ftp.debian.org jessie/non-free Translation-en
Err http://ftp.debian.org jessie/main arm64 Packages
404 Not Found [IP: 130.89.148.12 80]
Err http://ftp.debian.org jessie/contrib arm64 Packages
404 Not Found [IP: 130.89.148.12 80]
Err http://ftp.debian.org jessie/non-free arm64 Packages
404 Not Found [IP: 130.89.148.12 80]
Hit http://oph.mdrjr.net all InRelease
Hit http://oph.mdrjr.net jessie InRelease
Hit /http://archive.debian.org jessie-backports/contrib Translation-en
Hit /http://archive.debian.org jessie-backports/main Translation-en
Get:3 http://oph.mdrjr.net all/c2 arm64 Packages
Hit /http://archive.debian.org jessie-backports/non-free Translation-en
Hit http://oph.mdrjr.net all/c2 arm64 Packages
Hit /http://archive.debian.org jessie-backports/main Sources
Hit /http://archive.debian.org jessie-backports/contrib Sources
Get:4 http://oph.mdrjr.net all/main arm64 Packages
Hit /http://archive.debian.org jessie-backports/non-free Sources
Hit /http://archive.debian.org jessie-backports/main arm64 Packages
Get:5 http://oph.mdrjr.net all/testing arm64 Packages
Hit /http://archive.debian.org jessie-backports/contrib arm64 Packages
Hit /http://archive.debian.org jessie-backports/non-free arm64 Packages
Hit http://oph.mdrjr.net all/main arm64 Packages
Get:6 http://oph.mdrjr.net all/c2 Translation-en_US [324 B]
Hit http://oph.mdrjr.net all/testing arm64 Packages
Get:7 http://oph.mdrjr.net all/c2 Translation-en [321 B]
Get:8 http://oph.mdrjr.net all/main Translation-en_US [326 B]
Get:9 http://oph.mdrjr.net all/main Translation-en [323 B]
Get:10 http://oph.mdrjr.net all/testing Translation-en_US [329 B]
Get:11 http://oph.mdrjr.net all/testing Translation-en [326 B]
Get:12 http://oph.mdrjr.net jessie/backports arm64 Packages
Get:13 http://oph.mdrjr.net jessie/main arm64 Packages
Get:14 http://oph.mdrjr.net jessie/backports Translation-en_US [334 B]
Get:15 http://oph.mdrjr.net jessie/backports Translation-en [331 B]
Hit http://oph.mdrjr.net jessie/backports arm64 Packages
Get:16 http://oph.mdrjr.net jessie/main Translation-en_US [329 B]
Hit http://oph.mdrjr.net jessie/main arm64 Packages
Get:17 http://oph.mdrjr.net jessie/main Translation-en [326 B]
Get:18 http://oph.mdrjr.net all/c2 Translation-en_US [324 B]
Get:19 http://oph.mdrjr.net all/c2 Translation-en [321 B]
Get:20 http://oph.mdrjr.net all/main Translation-en_US [326 B]
Get:21 http://oph.mdrjr.net all/main Translation-en [323 B]
Get:22 http://oph.mdrjr.net all/testing Translation-en_US [329 B]
Get:23 http://oph.mdrjr.net all/testing Translation-en [326 B]
Get:24 http://oph.mdrjr.net jessie/backports Translation-en_US [334 B]
Get:25 http://oph.mdrjr.net jessie/backports Translation-en [331 B]
Get:26 http://oph.mdrjr.net jessie/main Translation-en_US [329 B]
Get:27 http://oph.mdrjr.net jessie/main Translation-en [326 B]
Get:28 http://oph.mdrjr.net all/c2 Translation-en_US [324 B]
Get:29 http://oph.mdrjr.net all/c2 Translation-en [321 B]
Get:30 http://oph.mdrjr.net all/main Translation-en_US [326 B]
Get:31 http://oph.mdrjr.net all/main Translation-en [323 B]
Get:32 http://oph.mdrjr.net all/testing Translation-en_US [329 B]
Get:33 http://oph.mdrjr.net all/testing Translation-en [326 B]
Get:34 http://oph.mdrjr.net jessie/backports Translation-en_US [334 B]
Get:35 http://oph.mdrjr.net jessie/backports Translation-en [331 B]
Get:36 http://oph.mdrjr.net jessie/main Translation-en_US [329 B]
Get:37 http://oph.mdrjr.net jessie/main Translation-en [326 B]
Get:38 http://oph.mdrjr.net all/c2 Translation-en_US [324 B]
Get:39 http://oph.mdrjr.net all/c2 Translation-en [321 B]
Get:40 http://oph.mdrjr.net all/main Translation-en_US [326 B]
Get:41 http://oph.mdrjr.net all/main Translation-en [323 B]
Get:42 http://oph.mdrjr.net all/testing Translation-en_US [329 B]
Get:43 http://oph.mdrjr.net all/testing Translation-en [326 B]
Get:44 http://oph.mdrjr.net jessie/backports Translation-en_US [334 B]
Get:45 http://oph.mdrjr.net jessie/backports Translation-en [331 B]
Get:46 http://oph.mdrjr.net jessie/main Translation-en_US [329 B]
Get:47 http://oph.mdrjr.net jessie/main Translation-en [326 B]
Get:48 http://oph.mdrjr.net all/c2 Translation-en_US [324 B]
Ign http://oph.mdrjr.net all/c2 Translation-en_US
Get:49 http://oph.mdrjr.net all/c2 Translation-en [321 B]
Ign http://oph.mdrjr.net all/c2 Translation-en
Get:50 http://oph.mdrjr.net all/main Translation-en_US [326 B]
Ign http://oph.mdrjr.net all/main Translation-en_US
Get:51 http://oph.mdrjr.net all/main Translation-en [323 B]
Ign http://oph.mdrjr.net all/main Translation-en
Get:52 http://oph.mdrjr.net all/testing Translation-en_US [329 B]
Ign http://oph.mdrjr.net all/testing Translation-en_US
Get:53 http://oph.mdrjr.net all/testing Translation-en [326 B]
Ign http://oph.mdrjr.net all/testing Translation-en
Get:54 http://oph.mdrjr.net jessie/backports Translation-en_US [334 B]
Ign http://oph.mdrjr.net jessie/backports Translation-en_US
Get:55 http://oph.mdrjr.net jessie/backports Translation-en [331 B]
Ign http://oph.mdrjr.net jessie/backports Translation-en
Get:56 http://oph.mdrjr.net jessie/main Translation-en_US [329 B]
Ign http://oph.mdrjr.net jessie/main Translation-en_US
Get:57 http://oph.mdrjr.net jessie/main Translation-en [326 B]
Ign http://oph.mdrjr.net jessie/main Translation-en
W: Failed to fetch http://security.debian.org/dists/jessie ... /InRelease Unable to find expected entry 'main/binary-arm64/Packages' in Release file (Wrong sources.list entry or malformed file)
W: Failed to fetch http://ftp.debian.org/debian/dists/jess ... 4/Packages 404 Not Found [IP: 130.89.148.12 80]
W: Failed to fetch http://ftp.debian.org/debian/dists/jess ... 4/Packages 404 Not Found [IP: 130.89.148.12 80]
W: Failed to fetch http://ftp.debian.org/debian/dists/jess ... 4/Packages 404 Not Found [IP: 130.89.148.12 80]
E: Some index files failed to download. They have been ignored, or old ones used instead.
-- Installation of python3 and dependancies
Reading package lists...
Building dependency tree...
Reading state information...
build-essential is already the newest version.
python-dev is already the newest version.
python3 is already the newest version.
The following package was automatically installed and is no longer required:
linux-headers-3.14.29+
Use 'apt-get autoremove' to remove it.
0 upgraded, 0 newly installed, 0 to remove and 2 not upgraded.
-- Installed version of Python :
Python 3.4.2
-- Installation of pip for python3 and necessary libraries
Reading package lists...
Building dependency tree...
Reading state information...
python3-pip is already the newest version.
python-requests is already the newest version.
The following package was automatically installed and is no longer required:
linux-headers-3.14.29+
Use 'apt-get autoremove' to remove it.
The following extra packages will be installed:
libpython3-dev libpython3.4 libpython3.4-dev python3.4-dev
The following NEW packages will be installed:
libpython3-dev libpython3.4 libpython3.4-dev python3-dev python3.4-dev
0 upgraded, 5 newly installed, 0 to remove and 2 not upgraded.
Need to get 3,489 kB of archives.
After this operation, 18.3 MB of additional disk space will be used.
Err http://ftp.debian.org/debian/ jessie/main libpython3.4 arm64 3.4.2-1
404 Not Found [IP: 130.89.148.12 80]
Err http://ftp.debian.org/debian/ jessie/main libpython3.4-dev arm64 3.4.2-1
404 Not Found [IP: 130.89.148.12 80]
Err http://ftp.debian.org/debian/ jessie/main libpython3-dev arm64 3.4.2-2
404 Not Found [IP: 130.89.148.12 80]
Err http://ftp.debian.org/debian/ jessie/main python3.4-dev arm64 3.4.2-1
404 Not Found [IP: 130.89.148.12 80]
Err http://ftp.debian.org/debian/ jessie/main python3-dev arm64 3.4.2-2
404 Not Found [IP: 130.89.148.12 80]
E: Failed to fetch http://ftp.debian.org/debian/pool/main/ ... _arm64.deb 404 Not Found [IP: 130.89.148.12 80]
E: Failed to fetch http://ftp.debian.org/debian/pool/main/ ... _arm64.deb 404 Not Found [IP: 130.89.148.12 80]
E: Failed to fetch http://ftp.debian.org/debian/pool/main/ ... _arm64.deb 404 Not Found [IP: 130.89.148.12 80]
E: Failed to fetch http://ftp.debian.org/debian/pool/main/ ... _arm64.deb 404 Not Found [IP: 130.89.148.12 80]
E: Failed to fetch http://ftp.debian.org/debian/pool/main/ ... _arm64.deb 404 Not Found [IP: 130.89.148.12 80]
E: Unable to fetch some archives, maybe run apt-get update or try with --fix-missing?
-- Installation of TTS libraries
Reading package lists...
Building dependency tree...
Reading state information...
The following package was automatically installed and is no longer required:
linux-headers-3.14.29+
Use 'apt-get autoremove' to remove it.
The following extra packages will be installed:
libltdl7 libopencore-amrnb0 libopencore-amrwb0 libsox-fmt-alsa
libsox-fmt-base libsox2 libttspico-data libttspico0 libvorbisfile3
libwavpack1
Suggested packages:
libsox-fmt-all
The following NEW packages will be installed:
libltdl7 libopencore-amrnb0 libopencore-amrwb0 libsox-fmt-alsa
libsox-fmt-base libsox2 libttspico-data libttspico-utils libttspico0
libvorbisfile3 libwavpack1 sox
0 upgraded, 12 newly installed, 0 to remove and 2 not upgraded.
Need to get 864 kB/5,012 kB of archives.
After this operation, 8,646 kB of additional disk space will be used.
Err http://ftp.debian.org/debian/ jessie/main libltdl7 arm64 2.4.2-1.11
404 Not Found [IP: 130.89.148.12 80]
Err http://ftp.debian.org/debian/ jessie/main libopencore-amrnb0 arm64 0.1.3-2.1
404 Not Found [IP: 130.89.148.12 80]
Err http://ftp.debian.org/debian/ jessie/main libopencore-amrwb0 arm64 0.1.3-2.1
404 Not Found [IP: 130.89.148.12 80]
Err http://ftp.debian.org/debian/ jessie/main libsox2 arm64 14.4.1-5
404 Not Found [IP: 130.89.148.12 80]
Err http://ftp.debian.org/debian/ jessie/main libvorbisfile3 arm64 1.3.4-2+deb8u1
404 Not Found [IP: 130.89.148.12 80]
Err http://ftp.debian.org/debian/ jessie/main libwavpack1 arm64 4.70.0-1
404 Not Found [IP: 130.89.148.12 80]
Err http://ftp.debian.org/debian/ jessie/non-free libttspico0 arm64 1.0+git20130326-3
404 Not Found [IP: 130.89.148.12 80]
Err http://ftp.debian.org/debian/ jessie/main libsox-fmt-alsa arm64 14.4.1-5
404 Not Found [IP: 130.89.148.12 80]
Err http://ftp.debian.org/debian/ jessie/main libsox-fmt-base arm64 14.4.1-5
404 Not Found [IP: 130.89.148.12 80]
Err http://ftp.debian.org/debian/ jessie/main sox arm64 14.4.1-5
404 Not Found [IP: 130.89.148.12 80]
Err http://security.debian.org/ jessie/updates/main libvorbisfile3 arm64 1.3.4-2+deb8u1
404 Not Found [IP: 151.101.120.204 80]
Err http://ftp.debian.org/debian/ jessie/non-free libttspico-utils arm64 1.0+git20130326-3
404 Not Found [IP: 130.89.148.12 80]
E: Failed to fetch http://ftp.debian.org/debian/pool/main/ ... _arm64.deb 404 Not Found [IP: 130.89.148.12 80]
E: Failed to fetch http://ftp.debian.org/debian/pool/main/ ... _arm64.deb 404 Not Found [IP: 130.89.148.12 80]
E: Failed to fetch http://ftp.debian.org/debian/pool/main/ ... _arm64.deb 404 Not Found [IP: 130.89.148.12 80]
E: Failed to fetch http://ftp.debian.org/debian/pool/main/ ... _arm64.deb 404 Not Found [IP: 130.89.148.12 80]
E: Failed to fetch http://security.debian.org/pool/updates ... _arm64.deb 404 Not Found [IP: 151.101.120.204 80]
E: Failed to fetch http://ftp.debian.org/debian/pool/main/ ... _arm64.deb 404 Not Found [IP: 130.89.148.12 80]
E: Failed to fetch http://ftp.debian.org/debian/pool/non-f ... _arm64.deb 404 Not Found [IP: 130.89.148.12 80]
E: Failed to fetch http://ftp.debian.org/debian/pool/main/ ... _arm64.deb 404 Not Found [IP: 130.89.148.12 80]
E: Failed to fetch http://ftp.debian.org/debian/pool/main/ ... _arm64.deb 404 Not Found [IP: 130.89.148.12 80]
E: Failed to fetch http://ftp.debian.org/debian/pool/main/ ... _arm64.deb 404 Not Found [IP: 130.89.148.12 80]
E: Failed to fetch http://ftp.debian.org/debian/pool/non-f ... _arm64.deb 404 Not Found [IP: 130.89.148.12 80]
E: Unable to fetch some archives, maybe run apt-get update or try with --fix-missing?
-- Installation of libav/ffmpeg libraries
Reading package lists...
Building dependency tree...
Reading state information...
libav-tools is already the newest version.
The following package was automatically installed and is no longer required:
linux-headers-3.14.29+
Use 'apt-get autoremove' to remove it.
The following extra packages will be installed:
libavcodec-extra-56 libopencore-amrnb0 libopencore-amrwb0 libvo-aacenc0
libvo-amrwbenc0
The following packages will be REMOVED:
libavcodec56
The following NEW packages will be installed:
libavcodec-extra libavcodec-extra-56 libopencore-amrnb0 libopencore-amrwb0
libvo-aacenc0 libvo-amrwbenc0
0 upgraded, 6 newly installed, 1 to remove and 2 not upgraded.
Need to get 3,009 kB/3,187 kB of archives.
After this operation, 658 kB of additional disk space will be used.
Err http://ftp.debian.org/debian/ jessie/main libopencore-amrnb0 arm64 0.1.3-2.1
404 Not Found [IP: 130.89.148.12 80]
Err http://ftp.debian.org/debian/ jessie/main libopencore-amrwb0 arm64 0.1.3-2.1
404 Not Found [IP: 130.89.148.12 80]
Err http://ftp.debian.org/debian/ jessie/main libavcodec-extra-56 arm64 6:11.12-1~deb8u1
404 Not Found [IP: 130.89.148.12 80]
Err http://security.debian.org/ jessie/updates/main libavcodec-extra-56 arm64 6:11.12-1~deb8u1
404 Not Found [IP: 151.101.120.204 80]
E: Failed to fetch http://ftp.debian.org/debian/pool/main/ ... _arm64.deb 404 Not Found [IP: 130.89.148.12 80]
E: Failed to fetch http://ftp.debian.org/debian/pool/main/ ... _arm64.deb 404 Not Found [IP: 130.89.148.12 80]
E: Failed to fetch http://security.debian.org/pool/updates ... _arm64.deb 404 Not Found [IP: 151.101.120.204 80]
E: Unable to fetch some archives, maybe run apt-get update or try with --fix-missing?
-- Upgrade setuptools with command pip3 if not up to date
Requirement already satisfied (use --upgrade to upgrade): setuptools in /usr/lib/python3/dist-packages
Cleaning up...
-- Installed version of pip :
pip 1.5.6 from /usr/lib/python3/dist-packages (python 3.4)
-- Installation of python library 'netifaces' with command pip3
Downloading/unpacking netifaces
Downloading netifaces-0.10.9.tar.gz
Running setup.py (path:/tmp/pip-build-0tkhow3a/netifaces/setup.py) egg_info for package netifaces
Installing collected packages: netifaces
Running setup.py install for netifaces
checking for getifaddrs...found.
checking for getnameinfo...found.
checking for IPv6 socket IOCTLs...not found.
checking for optional header files...netash/ash.h netatalk/at.h netax25/ax25.h neteconet/ec.h netipx/ipx.h netpacket/packet.h linux/irda.h linux/atm.h linux/llc.h linux/tipc.h linux/dn.h.
checking whether struct sockaddr has a length field...no.
checking which sockaddr_xxx structs are defined...at ax25 in in6 ipx un ash ec ll atmpvc atmsvc dn irda llc.
checking for routing socket support...no.
checking for sysctl(CTL_NET...) support...no.
checking for netlink support...yes.
will use netlink to read routing table
building 'netifaces' extension
aarch64-linux-gnu-gcc -pthread -DNDEBUG -g -fwrapv -O2 -Wall -Wstrict-prototypes -g -fstack-protector-strong -Wformat -Werror=format-security -D_FORTIFY_SOURCE=2 -fPIC -DNETIFACES_VERSION=0.10.9 -DHAVE_GETIFADDRS=1 -DHAVE_GETNAMEINFO=1 -DHAVE_NETASH_ASH_H=1 -DHAVE_NETATALK_AT_H=1 -DHAVE_NETAX25_AX25_H=1 -DHAVE_NETECONET_EC_H=1 -DHAVE_NETIPX_IPX_H=1 -DHAVE_NETPACKET_PACKET_H=1 -DHAVE_LINUX_IRDA_H=1 -DHAVE_LINUX_ATM_H=1 -DHAVE_LINUX_LLC_H=1 -DHAVE_LINUX_TIPC_H=1 -DHAVE_LINUX_DN_H=1 -DHAVE_SOCKADDR_AT=1 -DHAVE_SOCKADDR_AX25=1 -DHAVE_SOCKADDR_IN=1 -DHAVE_SOCKADDR_IN6=1 -DHAVE_SOCKADDR_IPX=1 -DHAVE_SOCKADDR_UN=1 -DHAVE_SOCKADDR_ASH=1 -DHAVE_SOCKADDR_EC=1 -DHAVE_SOCKADDR_LL=1 -DHAVE_SOCKADDR_ATMPVC=1 -DHAVE_SOCKADDR_ATMSVC=1 -DHAVE_SOCKADDR_DN=1 -DHAVE_SOCKADDR_IRDA=1 -DHAVE_SOCKADDR_LLC=1 -DHAVE_PF_NETLINK=1 -I/usr/include/python3.4m -c netifaces.c -o build/temp.linux-aarch64-3.4/netifaces.o
netifaces.c:1:20: fatal error: Python.h: No such file or directory
#include <Python.h>
^
compilation terminated.
error: command 'aarch64-linux-gnu-gcc' failed with exit status 1
Complete output from command /usr/bin/python3 -c "import setuptools, tokenize;__file__='/tmp/pip-build-0tkhow3a/netifaces/setup.py';exec(compile(getattr(tokenize, 'open', open)(__file__).read().replace('
', '
'), __file__, 'exec'))" install --record /tmp/pip-c60d1ejd-record/install-record.txt --single-version-externally-managed --compile:
running install
running build
running build_ext
checking for getifaddrs...found.
checking for getnameinfo...found.
checking for IPv6 socket IOCTLs...not found.
checking for optional header files...netash/ash.h netatalk/at.h netax25/ax25.h neteconet/ec.h netipx/ipx.h netpacket/packet.h linux/irda.h linux/atm.h linux/llc.h linux/tipc.h linux/dn.h.
checking whether struct sockaddr has a length field...no.
checking which sockaddr_xxx structs are defined...at ax25 in in6 ipx un ash ec ll atmpvc atmsvc dn irda llc.
checking for routing socket support...no.
checking for sysctl(CTL_NET...) support...no.
checking for netlink support...yes.
will use netlink to read routing table
building 'netifaces' extension
aarch64-linux-gnu-gcc -pthread -DNDEBUG -g -fwrapv -O2 -Wall -Wstrict-prototypes -g -fstack-protector-strong -Wformat -Werror=format-security -D_FORTIFY_SOURCE=2 -fPIC -DNETIFACES_VERSION=0.10.9 -DHAVE_GETIFADDRS=1 -DHAVE_GETNAMEINFO=1 -DHAVE_NETASH_ASH_H=1 -DHAVE_NETATALK_AT_H=1 -DHAVE_NETAX25_AX25_H=1 -DHAVE_NETECONET_EC_H=1 -DHAVE_NETIPX_IPX_H=1 -DHAVE_NETPACKET_PACKET_H=1 -DHAVE_LINUX_IRDA_H=1 -DHAVE_LINUX_ATM_H=1 -DHAVE_LINUX_LLC_H=1 -DHAVE_LINUX_TIPC_H=1 -DHAVE_LINUX_DN_H=1 -DHAVE_SOCKADDR_AT=1 -DHAVE_SOCKADDR_AX25=1 -DHAVE_SOCKADDR_IN=1 -DHAVE_SOCKADDR_IN6=1 -DHAVE_SOCKADDR_IPX=1 -DHAVE_SOCKADDR_UN=1 -DHAVE_SOCKADDR_ASH=1 -DHAVE_SOCKADDR_EC=1 -DHAVE_SOCKADDR_LL=1 -DHAVE_SOCKADDR_ATMPVC=1 -DHAVE_SOCKADDR_ATMSVC=1 -DHAVE_SOCKADDR_DN=1 -DHAVE_SOCKADDR_IRDA=1 -DHAVE_SOCKADDR_LLC=1 -DHAVE_PF_NETLINK=1 -I/usr/include/python3.4m -c netifaces.c -o build/temp.linux-aarch64-3.4/netifaces.o
netifaces.c:1:20: fatal error: Python.h: No such file or directory
#include <Python.h>
^
compilation terminated.
error: command 'aarch64-linux-gnu-gcc' failed with exit status 1
----------------------------------------
Cleaning up...
Command /usr/bin/python3 -c "import setuptools, tokenize;__file__='/tmp/pip-build-0tkhow3a/netifaces/setup.py';exec(compile(getattr(tokenize, 'open', open)(__file__).read().replace('
', '
'), __file__, 'exec'))" install --record /tmp/pip-c60d1ejd-record/install-record.txt --single-version-externally-managed --compile failed with error code 1 in /tmp/pip-build-0tkhow3a/netifaces
Storing debug log for failure in /root/.pip/pip.log
-- Installation of python library 'requests' with command pip3
Requirement already satisfied (use --upgrade to upgrade): requests in /usr/lib/python3/dist-packages
Cleaning up...
-- Installation of python library 'protobuf' with command :( pip3
Requirement already satisfied (use --upgrade to upgrade): protobuf in /usr/local/lib/python3.4/dist-packages
Cleaning up...
-- Installation of python library 'zeroconf' with command pip3
Requirement already satisfied (use --upgrade to upgrade): zeroconf in /usr/local/lib/python3.4/dist-packages
Cleaning up...
-- Installation of python library 'click, bs4 and six' for TTS with command pip3
Requirement already satisfied (use --upgrade to upgrade): click in /usr/local/lib/python3.4/dist-packages
Requirement already satisfied (use --upgrade to upgrade): bs4 in /usr/local/lib/python3.4/dist-packages
Requirement already satisfied (use --upgrade to upgrade): six in /usr/local/lib/python3.4/dist-packages
Requirement already satisfied (use --upgrade to upgrade): beautifulsoup4 in /usr/local/lib/python3.4/dist-packages (from bs4)
Cleaning up...
-- Installation of python library 'tqdm, websocket-client' for plex with command pip3
Requirement already satisfied (use --upgrade to upgrade): tqdm in /usr/local/lib/python3.4/dist-packages
Requirement already satisfied (use --upgrade to upgrade): websocket-client in /usr/local/lib/python3.4/dist-packages
Cleaning up...
-- Installation of dependencies is done !
1 idée? je vois que des paquets d'IP ne fonctionne pas :/
Ps. J'ai redémarré ma box Jeedom toujours pareil.
J'ai l'impression que le plugin est mort malheureusement :(
Pas de réponse non plus du support.

Avatar de l’utilisateur
Donut
Timide
Messages : 182
Inscription : 07 févr. 2017, 09:53
Localisation : Charente-Maritime

Re: [Plugin Tiers][Sujet Principal] Google Cast

Message par Donut » 06 juin 2019, 08:32

Depuis hier soir je regarde pour migrer sous Stretch, j'ai un Raspberry qui ne fait rien pour le moment, je vais le mettre dessous et voir s'il y a du mieux avant de migrer ma Smart.
Je reviens pour vous dire.

Avatar de l’utilisateur
Donut
Timide
Messages : 182
Inscription : 07 févr. 2017, 09:53
Localisation : Charente-Maritime

Re: [Plugin Tiers][Sujet Principal] Google Cast

Message par Donut » 06 juin 2019, 17:23

Voilà, je reviens pour donner les dernières nouvelles.
Je viens d'installer Stretch (Release 9.9) sur mon Raspberry Pi 3, et le plugin ChromeCast fonctionne très bien.
Le problème vient bien de ma Smart Jeedom sous Jessie...

Je pensai donc passer ma Smart sous Stretch aussi,
Les commandes sont bien ? :
apt-get -y update
apt-get -y upgrade
apt-get -y dist-upgrade
Où, vaut mieux que je récup l'image de Stretch directement sur 1 clé USB et que je l'installe en manuel sur ma Smart?

Répondre

Revenir vers « [Catégorie] Multimédia »

Qui est en ligne ?

Utilisateurs parcourant ce forum : Aucun utilisateur inscrit et 1 invité